program: Orca
programVersion: 5.0.2
elementType: Cl Cl F F F F O O C C C C C C C C C C C C C C C H H H H H H H H H H H H
charge: 0
multiplicity: 1
keywords: wb97x-d3
keywords: def2-TZVPP
keywords: def2/J RIJCOSX
keywords: DEFGRID2
keywords: scfconv7
keywords: smallprint printgap noloewdin
keywords: NOSOSCF
formula: C15H12Cl2F4O2
InChI: InChI=1/C15H12Cl2F4O2/c1-15(2)7(3-10(16)17)11(15)14(22)23-5-6-12(20)8(18)4-9(19)13(6)21/h3-4,7,11H,5H2,1-2H3
35 atoms
Cl -3.916172 1.069745 1.921294
Cl -6.235936 0.478529 0.310859
F  2.42974 -1.114413 -1.643248
F  2.903266 2.50983 1.319171
F  4.929809 1.263578 2.519988
F  4.452388 -2.370805 -0.41709
O  0.294974 0.707947 -0.809398
O  0.064355 0.495498 -3.028057
C  -1.622413 -1.718644 -0.712045
C  -1.539732 -0.518525 -1.63406
C  -2.31463 -0.440665 -0.330928
C  -0.444392 -2.153644 0.125279
C  -2.424734 -2.886524 -1.233873
C  -3.772686 -0.289533 -0.405321
C  -0.319658 0.266855 -1.903946
C  -4.528717 0.330795 0.491502
C  1.509615 1.450249 -0.930157
C  2.610702 0.736342 -0.203961
C  3.034945 -0.519268 -0.613149
C  3.268812 1.308572 0.8720
C  4.31862 0.661318 1.499923
C  4.075781 -1.169369 0.019129
C  4.732363 -0.584097 1.082588
H  -2.145147 -0.614322 -2.528166
H  -1.830249 0.108513 0.467452
H  0.058623 -1.332209 0.628922
H  -0.791419 -2.842381 0.897212
H  0.288092 -2.687022 -0.48257
H  -2.875731 -3.439422 -0.408237
H  -3.220274 -2.590559 -1.916259
H  -1.771726 -3.573672 -1.774267
H  -4.281946 -0.70689 -1.265789
H  1.328731 2.431289 -0.496734
H  1.782226 1.597558 -1.974563
H  5.551801 -1.091451 1.575046
elementType: Cl F O C H
totalener: -2049.15398372 hartree
nucrepener: 2241.02503220 hartree
electener: -4290.17901593 hartree
oneelecener: -7277.83785893 hartree
twoeener: 2987.65884300 hartree
cpcmener: -0.02565363 hartree
kineticenergy: 2043.53459561 hartree
xcener: -143.165781809021 hartree
chargesum: -0.0000000
charge: -0.058672 -0.062310 -0.204556 -0.203599 -0.203497 -0.203436 -0.273756 -0.484353 0.091186 -0.106789 0.058372 -0.276206 -0.266035 -0.217642 0.437190 0.042053 0.044843 -0.107307 0.222324 0.226635 0.201351 0.209189 -0.169486 0.096476 0.084166 0.089557 0.102416 0.099581 0.099626 0.092192 0.099028 0.132900 0.116445 0.135784 0.156328
qa: -0.0587 -0.0623 -0.2046 -0.2036 -0.2035 -0.2034 -0.2738 -0.4844 0.0912 -0.1068 0.0584 -0.2762 -0.2660 -0.2176 0.4372 0.0421 0.0448 -0.1073 0.2223 0.2266 0.2014 0.2092 -0.1695 0.0965 0.0842 0.0896 0.1024 0.0996 0.0996 0.0922 0.0990 0.1329 0.1164 0.1358 0.1563
va: 1.2670 1.2429 1.0936 1.0974 1.0846 1.0864 2.1196 2.0169 3.7196 3.8446 3.8295 3.9030 3.9098 3.8893 4.1666 4.2092 3.8383 3.6010 3.8406 3.9150 3.9565 3.9859 3.8684 1.0307 1.0429 1.0133 1.0016 1.0043 1.0012 1.0058 1.0006 1.0182 1.0126 1.0185 0.9973
dispcorr: -0.017847715 hartree
energy: -2049.171831437611
dipole: -7.37451 7.97789 0.60338 -16.13529 15.32583 -0.80946 -11.49766 12.08711 0.58945
magnitude: 1.16908 au
magnitude: 2.97157 debye
