program: Gaussian 09
title: 000071149
version: EM64L-G09RevD.01
frameworkgroup: C1[X(C9H15BrN2O2)]
method: RPBEPBE
basis: SDD
operation: Freq
keyword: #p
keyword: freq=noraman
keyword: PBEPBE/SDD
title: #p freq=noraman PBEPBE/SDD
converged: YES YES NO NO
title: Mulliken charges:
elementType: Br O O N N C C C C C C C C C H H H H H H H H H H H H H H H
charge: 0.044145 -0.458264 -0.226371 -0.420245 -0.002994 0.259722 -0.421021 -0.710072 -0.679989 -0.680833 -0.134717 0.321535 -0.346435 -0.150614 0.273482 0.241298 0.232931 0.231508 0.218090 0.205849 0.213753 0.228214 0.215833 0.208804 0.218218 0.225377 0.221147 0.302162 0.369484
chargesum: 0.00000
title: Mulliken charges with hydrogens summed into heavy atoms:
elementType: Br O O N N C C C C C C C C C
charge: 0.044145 -0.088780 -0.226371 -0.146762 -0.002994 0.259722 0.053208 -0.054624 -0.022189 -0.028434 0.086430 0.321535 -0.044273 -0.150614
polarizability: 1.91587050e+02 1.47269670e+01 1.11391862e+02 -5.15306923e+00 8.30510479e+00 1.00700806e+02
1716.lowfreq: -12.6136 -2.4306 -0.0005 0.0003 0.0004 7.8902 16.7409 25.8601 49.5572
frequency: 15.9198 25.3002 49.4035 59.8025 101.4812 123.4906 164.1229 182.7339 219.0242 242.8060 250.5320 256.3811 270.4862 288.7783 332.7112 345.5964 374.7955 414.0854 429.9321 449.0250 496.5521 527.1419 602.6537 648.4983 657.9171 734.6843 768.4356 793.6245 833.2368 848.9387 864.2126 894.1905 907.7738 909.4913 925.4898 943.6759 950.7882 1002.2124 1020.7015 1034.8220 1055.5684 1077.6087 1087.8405 1160.6250 1179.0003 1212.2539 1238.5655 1271.9490 1277.6457 1292.7673 1310.0415 1332.6916 1365.1155 1375.4887 1381.4476 1405.0808 1406.6581 1441.9283 1451.7277 1459.9734 1461.9215 1469.2034 1485.4476 1488.4007 1493.8942 1591.6919 2922.0719 2973.0529 2976.5695 2988.2446 2990.4986 3066.4497 3073.3145 3076.5003 3081.4421 3085.9853 3089.9856 3090.3304 3097.6364 3276.3778 3424.4937
redmass: 4.6017 3.6806 4.6111 4.1339 3.7241 6.0781 1.6402 2.5489 1.9027 2.3840 1.2195 1.1768 7.5759 5.6512 2.7712 2.7180 3.3820 5.3700 2.8534 2.3465 2.9361 3.3821 8.2402 2.3665 2.2969 2.5823 3.8098 14.1148 1.1635 1.3496 2.5564 2.4079 2.5872 3.5703 1.5796 1.2325 3.9591 1.8323 1.4759 2.4814 2.2771 1.8190 3.5320 3.0376 1.4293 2.4560 2.9774 2.0405 1.2661 2.0547 1.7103 1.2591 5.0819 1.2144 1.2276 1.2114 1.6649 1.1868 1.0629 1.0533 1.0499 1.0682 1.0626 1.0999 1.0586 7.7508 1.0821 1.0362 1.0365 1.0396 1.0614 1.0985 1.0986 1.0995 1.0986 1.0967 1.0689 1.0995 1.0951 1.1005 1.0741
irintensity: 0.6484 1.3976 4.0867 2.6216 2.8336 3.5634 1.7262 0.5744 5.1558 1.6746 0.9971 0.7838 4.5548 0.9752 0.7929 1.7029 2.2998 2.4481 0.2224 0.9277 0.4567 1.5070 0.3913 13.4737 13.4482 11.2011 7.0941 13.6393 109.2842 83.0998 17.9818 3.1760 16.9904 28.3403 4.5441 0.7171 21.8489 9.1414 10.1562 44.3958 11.8729 19.7763 32.6930 11.3820 74.4111 78.8432 24.2444 7.9621 21.1155 69.8997 28.6465 16.0865 77.7324 34.2854 24.2969 29.0680 100.4786 17.7915 3.7727 1.8889 1.1791 4.1951 12.8472 7.7901 21.0308 63.3340 45.9762 21.9462 33.9081 16.7815 25.2050 6.8842 41.8777 6.7493 43.2350 19.8182 398.9954 10.1084 17.7104 5.4329 0.2853
temp: 298.150 k
press: 1.00000 atm
elementType: 35 8 8 7 7 6 6 6 6 6 6 6 6 6 1 1 1 1 1 1 1 1 1 1 1 1 1 1 1
symmnumber: 1
zpe: 609790.1 jmol-1
zpe.correction: 0.232257 hartree
zpe.thermalcorrener: 0.247991 hartree
zpe.thermalcorrenthalpy: 0.248935 hartree
zpe.thermalcorrgfe: 0.186346 hartree
zpe.sumelectzpe: -624.194114 hartree
zpe.sumelectthermal: -624.178380 hartree
zpe.sumelectthermalent: -624.177436 hartree
zpe.sumelectthermalfe: -624.240025 hartree
dipole: -6.0397 1.1780 -0.3313
dipole: 6.1624
quadrupole: -81.8341 -93.5680 -101.1599
quadrupole: 7.6646 6.1038 -3.0121
quadrupole: 10.3533 -1.3807 -8.9726 7.6646 6.1038 -3.0121
hfenergy: -624.4263713 hartree
pointgroup: C01 [X(C9H15Br1N2O2)]
dipole: -2.4180624 0.1687732 0.0511591 debye
polarizability: 184.9074374|8.6202111|98.9316427|25.8312247|-5.2958752|119.8406374 unknown
InChI: InChI=1S/C9H15BrN2O2/c1-9(2,3)11-5-6(13)7-4-8(10)12-14-7/h4,6,11,13H,5H2,1-3H3
charge 0 multiplicity 1
29 atoms
Br 5.009512 0.296635 1.761208
O  -0.292469 -1.888408 0.298565
O  2.18755 0.421123 -1.170116
N  -2.23294 -0.356818 -0.590958
N  3.496405 0.794481 -0.586719
C  -3.316025 0.378602 0.159116
C  -0.892506 0.263786 -0.716684
C  -4.594934 -0.48225 0.018045
C  -2.927821 0.482509 1.654198
C  -3.565423 1.794111 -0.434244
C  0.159815 -0.907934 -0.673456
C  1.521335 -0.427848 -0.270481
C  2.303432 -0.630998 0.850013
C  3.489632 0.13779 0.59638
H  -2.589269 -0.676604 -1.50362
H  -0.749071 0.868924 -1.632862
H  -0.723208 0.917627 0.154494
H  -4.432646 -1.491881 0.435697
H  -5.437146 -0.01254 0.555515
H  -4.891445 -0.588223 -1.043796
H  -2.033989 1.112392 1.811815
H  -2.721444 -0.51828 2.072487
H  -3.756486 0.937974 2.22519
H  -3.87613 1.728683 -1.494253
H  -4.364368 2.316527 0.123127
H  -2.654934 2.418379 -0.379622
H  0.226122 -1.361344 -1.68868
H  2.068126 -1.247854 1.710264
H  -1.301379 -1.741261 0.271878
