program: QuantumEspresso
programVersion: 7.2
elementType: Cu Ga O C H
subdivisionN: 3 3 1
lattice: 10.074476 0.000000 0.000000 angstrom
lattice: 0.000000 10.074476 0.000000 angstrom
lattice: 0.000000 0.000000 29.415153 angstrom
elementType: Cu
elementType: Ga
elementType: O
elementType: C
elementType: H
formula: C2H20Cu63GaO12
98 atoms
Cu 1.351488 1.351488 12.028931
Cu 3.87015 1.351499 12.02897
Cu 1.351499 3.87015 12.02897
Cu 3.870165 3.870165 12.029055
Cu 0.092268 0.092268 13.842987
Cu 2.610873 0.092275 13.842999
Cu 0.092275 2.610873 13.842999
Cu 2.610877 2.610877 13.843015
Cu 1.347587 1.397258 15.724934
Cu 3.864945 1.35505 15.680212
Cu 1.36278 3.873161 15.742811
Cu 3.869306 3.878429 15.676995
Cu 0.105956 0.075872 17.450651
Cu 2.606732 0.073777 17.465475
Cu 0.144463 2.648337 17.632797
Cu 2.646861 2.591891 17.573575
Cu 1.351548 6.38869 12.029071
Cu 3.870208 6.388709 12.029108
Cu 1.351578 8.907251 12.029128
Cu 3.870243 8.907275 12.029178
Cu 0.092301 5.129395 13.843116
Cu 2.610904 5.129406 13.843126
Cu 0.092335 7.648026 13.843174
Cu 2.610938 7.648036 13.843177
Cu 1.3761 6.372824 15.707178
Cu 3.87207 6.37932 15.703596
Cu 1.350539 8.907704 15.661692
Cu 3.874981 8.897965 15.670967
Cu 0.08599 5.18038 17.483227
Cu 2.596715 5.159634 17.619319
Cu 0.103604 7.654333 17.478527
Cu 2.618353 7.680182 17.480156
Cu 6.38869 1.351548 12.029071
Cu 8.907251 1.351578 12.029128
Cu 6.388709 3.870208 12.029108
Cu 8.907275 3.870243 12.029178
Cu 5.129395 0.092301 13.843116
Cu 7.648026 0.092335 13.843174
Cu 5.129406 2.610904 13.843126
Cu 7.648036 2.610938 13.843177
Cu 6.38536 1.358082 15.714453
Cu 8.90485 1.374918 15.733117
Cu 6.388225 3.846977 15.738602
Cu 8.907903 3.846768 15.74539
Cu 5.112167 0.060314 17.471158
Cu 7.632921 0.048517 17.505154
Cu 5.097408 2.57014 17.548683
Cu 7.602954 2.604915 17.597313
Cu 6.388749 6.388749 12.029206
Cu 8.907314 6.388781 12.029267
Cu 6.388781 8.907314 12.029267
Cu 8.907344 8.907344 12.029322
Cu 5.129435 5.129435 13.843236
Cu 7.648068 5.129466 13.843284
Cu 5.129466 7.648068 13.843284
Cu 7.648101 7.648101 13.843352
Cu 6.385432 6.383705 15.692652
Cu 8.909228 6.388208 15.676239
Cu 6.400431 8.913981 15.682328
Cu 8.898054 8.913536 15.694323
Ga 5.17799 5.180243 17.649051
Cu 7.670581 5.147335 17.508465
Cu 5.151721 7.682258 17.490428
Cu 7.660295 7.634957 17.514021
O  3.811765 5.235294 20.311336
C  3.833145 4.57883 19.193436
O  3.918181 2.364886 20.180661
C  3.895816 3.105686 19.125098
O  6.189364 2.47878 21.516778
H  6.232111 3.453124 21.714235
H  5.293655 2.39749 21.066481
O  5.849791 5.192571 21.912462
H  5.499826 5.372285 22.804238
H  5.046211 5.217322 21.287469
O  8.053272 6.677708 21.577145
H  8.022025 7.588151 21.182605
H  7.149726 6.262049 21.565282
O  7.728051 1.696583 19.551456
H  7.110436 2.055882 20.283735
H  8.653776 2.039678 19.76752
O  1.721053 1.341652 21.214463
H  2.589559 1.638463 20.812022
H  1.590977 0.387298 20.945931
O  1.9264 6.685078 21.427394
H  1.166563 6.042332 21.350641
H  2.655022 6.228991 20.908068
O  0.047627 2.698767 19.773151
H  -0.028507 3.601202 20.210665
H  0.730123 2.155935 20.319338
O  -0.149259 4.922364 21.254279
H  -0.91481 5.598857 21.259948
H  -0.176149 4.502977 22.134837
O  8.450152 -0.778305 20.979257
H  8.102199 -0.104067 20.352802
H  9.405318 -0.903624 20.724519
O  1.069821 -1.149955 20.455252
H  1.175562 -1.191526 19.471452
H  1.435734 -2.044061 20.805081
fermiener: -3.3397 electronvolt
totalener: -113481.973302 electronvolt
