program: Gaussian 16
title: porph
version: AS64L-G16RevC.02
method: RB3LYP
basis: Gen
operation: Freq
keyword: #P
keyword: Geom=AllCheck
keyword: Guess=TCheck
keyword: SCRF=Check
keyword: GenChk
keyword: RB3LYP/ChkBas
keyword: Freq
converged: YES YES YES YES
title: Mulliken charges:
elementType: N N N N C C C C C C C C C C C C C C C C C C C C H H H H H H H H C C C C H C H C H H C C C C H C H C H H C C C C H C H C H H C C C C H C H C H H H H C C C C O O O O O O O O
charge: 0.039233 0.080219 0.035795 0.109946 -0.164219 -0.640448 -0.591724 -0.071795 0.528997 -0.063592 -0.477824 -0.496700 -0.030590 0.519992 -0.047452 -0.644517 -0.656167 -0.127788 0.517303 -0.061911 -0.521589 -0.482389 -0.074712 0.545226 0.197553 0.200454 0.212874 0.210256 0.202128 0.201255 0.213698 0.215875 0.741967 -0.615619 -0.516955 -0.290215 0.202605 -0.446674 0.194257 0.275361 0.218667 0.222502 0.810661 -0.519056 -0.655353 -0.481368 0.194370 -0.265041 0.196536 0.250732 0.221933 0.220842 0.731998 -0.535582 -0.622810 -0.443633 0.193584 -0.311877 0.202367 0.292706 0.221617 0.218428 0.711536 -0.496757 -0.623276 -0.444366 0.197925 -0.264271 0.201011 0.266385 0.220404 0.219396 0.549717 0.659463 0.124355 0.116825 0.125031 0.135936 -0.560834 -0.560382 -0.560389 -0.559682 -0.560453 -0.560868 -0.561112 -0.559927
chargesum: -4.00000
title: Mulliken charges with hydrogens summed into heavy atoms:
elementType: N N N N C C C C C C C C C C C C C C C C C C C C C C C C C C C C C C C C C C C C C C C C C C C C C C C C O O O O O O O O
charge: 0.039233 0.629936 0.035795 0.769409 -0.164219 -0.442895 -0.391270 -0.071795 0.528997 -0.063592 -0.264951 -0.286444 -0.030590 0.519992 -0.047452 -0.442389 -0.454912 -0.127788 0.517303 -0.061911 -0.307890 -0.266513 -0.074712 0.545226 0.741967 -0.413014 -0.322699 -0.071548 -0.224172 0.275361 0.810661 -0.324686 -0.458817 -0.259436 -0.044198 0.250732 0.731998 -0.341998 -0.420443 -0.222016 -0.093449 0.292706 0.711536 -0.298832 -0.422264 -0.223961 -0.044876 0.266385 0.124355 0.116825 0.125031 0.135936 -0.560834 -0.560382 -0.560389 -0.559682 -0.560453 -0.560868 -0.561112 -0.559927
polarizability: 1.51364378e+03 7.23448707e-01 1.52998608e+03 -4.14307871e+01 -4.25066274e+01 6.84010979e+02
1716.lowfreq: -3.8854 -0.0006 -0.0005 0.0006 1.9821 3.4178 8.4670 17.0763 18.7224
frequency: 7.7684 16.8932 18.6941 20.6479 22.1423 23.5037 25.0269 26.1870 28.5689 35.3594 37.1352 42.9848 48.1764 54.7899 60.4749 66.3665 72.5704 75.4908 79.7957 111.5104 116.2218 119.0673 121.6529 123.3797 127.9494 147.2210 150.4319 155.8210 162.7927 168.8257 170.5713 187.3832 188.5927 203.5742 204.6725 223.4133 230.7457 262.3147 288.4775 289.9039 292.5973 293.6474 308.1302 326.4948 327.7490 331.7097 334.0435 345.3844 357.2229 371.0382 395.6598 396.2200 418.4042 419.5498 421.3262 421.7772 434.9906 441.7905 450.3268 469.2773 478.4934 485.7121 496.9282 501.8711 503.3642 506.2922 514.8576 534.8343 535.8112 551.6911 560.6670 568.5390 571.1642 579.6893 635.8619 642.8619 650.5348 651.5547 651.8630 655.1141 678.6248 685.2727 686.2950 693.5298 703.7288 704.0015 709.6699 713.1820 714.6822 718.9748 719.3529 721.6406 735.1124 742.7036 752.7770 761.1992 781.0065 782.1148 786.7073 793.3806 803.8452 809.7030 815.5153 818.2180 819.8369 821.8447 822.2049 823.1805 832.7149 844.3451 845.0446 847.0262 862.6439 863.1582 863.9392 864.6478 888.2566 890.3632 890.7984 895.9742 896.2961 901.1073 901.7045 903.5058 935.2242 936.6721 938.3876 939.1489 985.8727 986.7983 989.4801 990.7288 991.3618 993.4683 995.9339 1002.1949 1002.7084 1003.3582 1003.6253 1004.3473 1008.4941 1017.2544 1023.4423 1028.1904 1033.9339 1034.2076 1036.5204 1038.0958 1079.4227 1090.1247 1094.1082 1099.3019 1106.9166 1107.8498 1109.2068 1110.0687 1134.3932 1134.8431 1136.7348 1138.6414 1159.2236 1186.3123 1186.8765 1187.4351 1188.6026 1189.4669 1212.6872 1232.1020 1240.2840 1247.6137 1256.7246 1263.0086 1269.1084 1298.8569 1305.3843 1308.0458 1308.8949 1312.5548 1313.8908 1319.6911 1320.2476 1320.6199 1322.3425 1343.3845 1352.2582 1359.2859 1359.4204 1360.3692 1360.5315 1365.9861 1371.8871 1383.4681 1384.0039 1400.8653 1415.5211 1415.9404 1416.3736 1416.9804 1429.7508 1477.2172 1490.8107 1511.1799 1515.0263 1523.6839 1525.3634 1526.0638 1527.0883 1531.6145 1546.5222 1561.3103 1566.8015 1567.0792 1567.7644 1568.1611 1585.9516 1586.9648 1593.4428 1597.1077 1610.7096 1611.0781 1611.5597 1612.5788 1639.2373 1639.4333 1639.6901 1640.1418 3169.2890 3170.0143 3170.0706 3170.4018 3170.4337 3170.8874 3171.3706 3171.6020 3192.5693 3193.7241 3194.3764 3194.5455 3195.6748 3195.7874 3196.3163 3198.4330 3240.2609 3240.4900 3255.0496 3255.2581 3258.2586 3258.5164 3269.7274 3269.8686 3549.3662 3590.0898
redmass: 10.4563 10.0419 6.5427 11.6400 11.0019 9.6390 8.4560 9.4090 8.9366 8.5536 8.6572 9.0613 6.9503 6.9419 4.9339 5.2901 4.7945 7.9109 5.0411 5.6284 5.6971 7.0783 6.3689 6.6199 5.8304 9.9634 7.7916 8.0444 7.5701 8.5786 8.4792 9.0370 8.8523 7.6014 6.8717 6.5582 6.7740 6.0420 6.3838 6.8491 6.3232 6.7573 6.1212 7.8725 5.0551 5.1709 5.5585 5.3324 5.8866 7.7006 5.2735 5.1300 2.9877 2.9806 2.9977 2.9917 8.1304 4.3488 4.4723 5.5851 5.8722 7.0287 7.2722 8.4025 8.0146 7.5846 4.1634 3.9456 4.2589 4.2564 4.9481 5.9965 4.7065 5.6289 1.7990 3.1995 6.9870 6.4444 5.7635 4.5316 3.3141 2.1187 3.1990 8.5269 7.4367 7.3314 1.3051 7.5587 4.0328 4.0427 3.8783 3.5246 1.8546 2.6408 3.1857 4.7390 2.9597 3.3129 3.2929 3.5584 1.7170 2.4543 1.8728 2.1251 10.0182 9.2866 9.2726 9.2098 6.0590 5.6193 5.2300 4.7143 1.2455 1.2452 1.2447 1.2447 2.5907 2.8176 2.3136 2.6177 5.2499 4.1951 4.6852 6.6072 1.3361 1.3358 1.3377 1.3386 4.0174 2.9227 1.4167 1.4444 1.5561 1.9967 1.8970 1.3667 1.3606 2.0435 1.4279 1.3581 5.1779 3.9683 3.8042 4.6627 2.4915 2.4239 2.4370 2.4402 1.3217 1.1322 1.1258 1.2341 1.2975 1.2995 1.3028 1.3074 2.8061 2.7627 2.8466 2.9168 2.0774 1.4232 1.4204 1.3735 1.3577 3.1218 1.8305 1.6698 3.3290 2.4372 4.2511 5.4827 5.5383 4.5663 2.3602 1.6963 1.8572 1.9269 1.7732 3.9304 3.5488 3.3134 7.0933 2.8402 2.6704 10.7406 10.6372 10.9445 11.5692 9.1186 4.6772 3.8027 6.9479 4.0033 2.9218 2.9389 2.9571 2.9623 3.7028 6.7898 5.8589 7.3764 4.8259 3.0413 2.9168 2.7618 2.7110 4.5735 6.0905 7.3545 10.0138 9.7834 10.0788 9.9965 6.8918 5.9590 5.8255 10.7966 8.3312 8.2795 8.3181 8.5375 6.1204 6.1287 6.1072 6.0900 1.0891 1.0891 1.0889 1.0891 1.0889 1.0889 1.0892 1.0890 1.0923 1.0921 1.0935 1.0916 1.0933 1.0918 1.0928 1.0925 1.0893 1.0893 1.0912 1.0912 1.1049 1.1049 1.1033 1.1034 1.0828 1.0795
irintensity: 0.2946 23.7419 2.5084 16.3597 16.7296 14.2007 2.9669 7.1841 0.0999 0.3814 0.1748 0.1092 0.1198 0.0083 0.0325 0.0057 0.0058 0.0234 0.0657 21.7810 4.9989 10.4759 5.7883 23.0303 12.2557 0.1579 7.5658 8.8149 5.6270 0.6582 2.1366 15.4648 21.9853 0.1000 7.3010 0.0228 0.0653 0.2852 0.2163 4.0859 0.7522 0.4099 0.3780 0.1255 0.6070 0.5743 0.2288 1.6179 13.7746 4.2673 21.5873 12.1326 0.7081 1.6140 3.4257 4.0502 0.0085 0.1484 0.0887 41.9571 71.0761 0.1769 13.3813 3.9754 0.9025 0.9393 0.4819 9.7379 1.5752 0.1855 0.7795 13.2874 0.3171 0.4245 0.7357 15.2365 0.0068 0.0668 0.1467 3.5487 0.1537 0.9028 0.4149 0.2047 13.6098 4.7966 41.4015 0.0974 0.8950 70.1221 76.3700 3.1640 246.6917 9.8292 13.5550 24.1180 34.9263 61.6829 100.3221 1.2828 5.8790 0.3940 0.5647 272.0903 2.4135 321.0698 343.9117 8.1955 11.0163 2.8608 19.8357 1.3168 0.0438 0.0614 0.1410 0.1044 41.9032 39.2843 3.5108 6.2549 0.0698 1.3489 23.1490 0.1833 0.0146 0.0140 0.0140 0.1482 23.8715 141.7751 2.4767 2.8717 10.7848 78.5156 0.0973 0.8881 0.6415 2.8129 1.9150 0.9810 98.4812 82.5592 0.1681 0.3986 10.7736 60.4361 21.9041 17.5635 2.2981 14.7550 0.3331 0.1498 9.9343 15.3309 23.9500 7.3936 1.9089 1.7363 3.0569 2.1799 0.0044 12.6314 13.8425 8.1256 1.0112 98.4134 40.2414 0.0163 28.5801 72.2290 0.3677 0.0399 30.4257 1.4805 7.2207 0.2052 1.8273 8.4223 2.8527 4.4438 6.8079 30.3731 11.0513 0.5788 0.4517 1864.3941 1922.6054 130.5847 139.2642 1.9149 32.1337 19.6153 4.3895 0.0292 1.6396 1.5817 13.5558 13.2638 40.7681 0.0219 0.5870 256.7644 43.5704 0.3654 5.0660 0.2688 0.0097 0.0107 10.7901 104.3266 1130.7702 59.9110 239.9653 1244.7274 0.4153 40.3893 140.6983 86.6718 255.4672 87.7435 989.7273 52.5610 29.4684 43.4537 20.2302 27.1922 11.6019 9.8014 9.7793 12.4798 8.5164 9.0358 9.9709 9.5257 21.1131 19.6583 0.0681 21.5885 0.8545 16.9035 0.2592 3.3378 3.1032 3.1670 0.1680 0.1049 19.0536 13.0724 2.6410 1.9771 201.3626 0.2984
temp: 298.150 k
press: 1.00000 atm
elementType: 7 7 7 7 6 6 6 6 6 6 6 6 6 6 6 6 6 6 6 6 6 6 6 6 1 1 1 1 1 1 1 1 6 6 6 6 1 6 1 6 1 1 6 6 6 6 1 6 1 6 1 1 6 6 6 6 1 6 1 6 1 1 6 6 6 6 1 6 1 6 1 1 1 1 6 6 6 6 8 8 8 8 8 8 8 8
symmnumber: 1
zpe: 1634667.1 jmol-1
zpe.correction: 0.622612 hartree
zpe.thermalcorrener: 0.670025 hartree
zpe.thermalcorrenthalpy: 0.670969 hartree
zpe.thermalcorrgfe: 0.533100 hartree
zpe.sumelectzpe: -2666.551553 hartree
zpe.sumelectthermal: -2666.504140 hartree
zpe.sumelectthermalent: -2666.503196 hartree
zpe.sumelectthermalfe: -2666.641065 hartree
dipole: -55.0080 -26.9872 0.4243
dipole: 61.2729
quadrupole: -1467.4561 -1314.5157 -375.2076
quadrupole: -77.5246 14.7470 10.7219
quadrupole: -415.0630 -262.1226 677.1855 -77.5246 14.7470 10.7219
hfenergy: -2667.1741649 hartree
pointgroup: C01 [X(C48H26N4O8)]
dipole: 0.0688115 -0.0176503 -0.234106 debye
polarizability: 1513.6437814|0.7234487|1529.9860838|-41.4307871|-42.5066274|684.0109794 unknown
InChI: InChI=1/C48H26N4O8/c53-45(54)29-9-1-25(2-10-29)41-33-17-19-35(49-33)42(26-3-11-30(12-4-26)46(55)56)37-21-23-39(51-37)44(28-7-15-32(16-8-28)48(59)60)40-24-22-38(52-40)43(36-20-18-34(41)50-36)27-5-13-31(14-6-27)47(57)58/h1-24,49,52H
charge -4 multiplicity 1
86 atoms
N  0.84516577 1.40215106 0.00018726
N  2.88249893 3.50445851 -0.14192616
N  4.910517 1.39803863 -0.11305526
N  2.87305306 -0.70363153 -0.00198043
C  0.01905807 0.31097342 -0.03184137
C  -1.37308199 0.72467771 -0.15808474
C  -1.37069865 2.07997516 -0.18716591
C  0.02300058 2.49397449 -0.07866922
C  0.42513255 3.84273741 -0.07647351
C  1.7524854 4.28827426 -0.07655955
C  2.20292967 5.64599684 0.00621245
C  3.57235014 5.64415451 -0.01591247
C  4.0159117 4.28521638 -0.11220906
C  5.34161522 3.83617813 -0.14116059
C  5.7394392 2.48688955 -0.15414247
C  7.13499869 2.06764804 -0.21023317
C  7.1311674 0.71240947 -0.18195377
C  5.73294278 0.30359681 -0.12439322
C  5.32976554 -1.04213648 -0.06120729
C  4.00502515 -1.48702243 0.00342152
C  3.55905415 -2.84757616 0.06168223
C  2.18994785 -2.84733317 0.09503848
C  1.7417361 -1.48705873 0.04101928
C  0.41633097 -1.0381984 0.02007925
H  -2.22104685 0.06329036 -0.23170357
H  -2.21636073 2.74030141 -0.29022086
H  1.55274306 6.50075846 0.08611749
H  4.22746298 6.49699498 0.0421666
H  7.98743055 2.72518967 -0.26262941
H  7.97976378 0.04784996 -0.19804424
H  4.21299861 -3.70326554 0.07534373
H  1.53829502 -3.70312251 0.14689613
C  6.40149741 4.88795132 -0.14586169
C  6.56531734 5.73151392 -1.25054855
C  7.24822518 5.05623574 0.95583208
C  7.55281719 6.71241491 -1.25328407
H  5.91863176 5.60985746 -2.11219963
C  8.23131874 6.04127274 0.95002933
H  7.12777535 4.41410392 1.82091023
C  8.39945059 6.88292413 -0.15385324
H  7.68089067 7.35932638 -2.11176418
H  8.88148534 6.17211504 1.80566807
C  6.38855171 -2.0971608 -0.06323781
C  7.11564859 -2.376343 -1.2254819
C  6.67029197 -2.82767421 1.09613366
C  8.10065617 -3.35988319 -1.22507321
H  6.90278472 -1.82023514 -2.13152103
C  7.65610041 -3.81065031 1.09158367
H  6.11621401 -2.61776217 2.00418648
C  8.38528258 -4.0909176 -0.06775194
H  8.66146606 -3.5761724 -2.12560616
H  7.87538115 -4.37307351 1.99037623
C  -0.64903446 -2.08382644 0.0470042
C  -0.82693854 -2.95752832 -1.03184832
C  -1.49536726 -2.20804873 1.15492664
C  -1.82643937 -3.92583357 -1.00255367
H  -0.18353477 -2.86803631 -1.89981693
C  -2.49112136 -3.17981521 1.18081622
H  -1.36571242 -1.54032037 1.99905467
C  -2.6727438 -4.05208799 0.10326111
H  -1.96531333 -4.59543289 -1.84186293
H  -3.14218366 -3.27548241 2.04029599
C  -0.63434768 4.89359232 -0.0685203
C  -1.49254555 5.03249096 1.02883935
C  -0.79268891 5.76212825 -1.15493957
C  -2.48007032 6.01273756 1.03693008
H  -1.37708884 4.37079582 1.87968327
C  -1.78484503 6.7381528 -1.14391386
H  -0.13971955 5.66206303 -2.01454817
C  -2.64246931 6.87894119 -0.04862497
H  -3.13907965 6.12045589 1.88891207
H  -1.90874255 7.40329024 -1.98905831
H  2.88245952 2.49191642 -0.16654605
H  2.87166473 0.30884922 -0.03153236
C  9.48287388 7.96506493 -0.15798915
C  -3.73290349 7.95391863 -0.03735542
C  -3.77241226 -5.11724375 0.13393929
C  9.46883583 -5.17231163 -0.07006319
O  9.56883731 8.67735139 -1.19343439
O  10.19897625 8.05417663 0.87451146
O  -4.46601854 8.00682154 0.98569168
O  -3.80726632 8.69686994 -1.05186758
O  -3.8627461 -5.86813349 -0.87339628
O  -4.49647456 -5.15500516 1.16412994
O  10.11477129 -5.32486209 -1.14070898
O  9.62488394 -5.82023117 0.99888299
