program: Gaussian 09
title: 000071202
version: EM64L-G09RevD.01
frameworkgroup: C1[X(C20H24N2OS)]
method: RPBEPBE
basis: SDD
operation: Freq
keyword: #p
keyword: freq=noraman
keyword: PBEPBE/SDD
title: #p freq=noraman PBEPBE/SDD
converged: YES YES NO NO
title: Mulliken charges:
elementType: S O N N C C C C C C C C C C C C C C C C C C C C H H H H H H H H H H H H H H H H H H H H H H H H
charge: 0.146635 -0.211447 -0.304542 -0.091554 0.016571 0.383099 0.368236 0.172909 0.175313 -0.695952 -0.788447 -0.396151 -0.395652 -0.326789 -0.321785 -0.139482 -0.268747 -0.269832 -0.236228 -0.242973 -0.654236 -0.289506 -0.615619 -0.618183 0.247532 0.219982 0.220807 0.219729 0.232525 0.221208 0.244352 0.242306 0.273644 0.281011 0.228580 0.226818 0.232161 0.230182 0.291158 0.266601 0.215042 0.221948 0.192940 0.219989 0.237879 0.189324 0.225900 0.222748
chargesum: 0.00000
title: Mulliken charges with hydrogens summed into heavy atoms:
elementType: S O N N C C C C C C C C C C C C C C C C C C C C
charge: 0.146635 -0.211447 -0.304542 -0.091554 0.016571 0.383099 0.368236 0.172909 0.175313 -0.007632 -0.114986 -0.151799 -0.153346 -0.053144 -0.040774 -0.139482 -0.040167 -0.043014 -0.004067 -0.012791 -0.096477 0.147483 0.035189 0.019789
polarizability: 2.90444891e+02 -8.18921596e-01 2.78739490e+02 2.52271083e+01 -3.45689005e+00 1.94348395e+02
1716.lowfreq: -7.9698 -7.0368 -1.1604 -0.0005 0.0007 0.0022 19.3338 23.4442 35.0324
frequency: 18.9894 22.9545 34.9368 54.4331 62.2630 75.2952 93.2116 102.3241 131.5993 139.5497 159.3934 179.9120 207.4903 210.6825 220.2967 226.5668 242.4425 253.6725 286.0138 293.5087 310.5667 319.5585 341.9680 346.1809 352.7660 367.0810 407.3442 412.4105 418.0477 421.9755 442.3774 460.7088 478.1756 517.5039 531.3042 556.4482 572.7486 595.8674 609.6310 628.6207 663.2834 681.8036 699.9068 740.4248 747.3159 756.6529 763.8443 766.6576 779.9506 811.6764 816.3659 866.0548 870.9767 904.1306 933.8174 944.6114 946.0333 950.3041 983.3452 985.3521 1003.0568 1006.4574 1022.4373 1038.6841 1041.7987 1042.0670 1063.8900 1068.6923 1081.5358 1089.7637 1112.8544 1124.5694 1126.7198 1131.2493 1148.5889 1163.8051 1177.8367 1179.3368 1223.8223 1229.1461 1245.1782 1254.2909 1265.7122 1268.9588 1272.6388 1297.2279 1303.0661 1308.1422 1360.7365 1374.8308 1376.8114 1387.0023 1397.8499 1419.0480 1424.7674 1441.0808 1441.8860 1444.7189 1460.4423 1461.1729 1462.9665 1468.6951 1469.0989 1474.5220 1477.0055 1486.6344 1487.0169 1487.4329 1501.9366 1580.2553 1591.3726 1599.6389 1604.9691 1620.6793 2854.1687 2868.1025 2896.6983 2983.7760 2988.8140 3016.4584 3027.8408 3039.4580 3047.4893 3075.6825 3077.9430 3083.5751 3087.4461 3092.1042 3098.9951 3127.8659 3132.0182 3133.0233 3148.8663 3150.7168 3162.2056 3166.0910 3172.3036 3194.2029
redmass: 4.7166 4.4002 2.6505 5.0784 5.2553 4.6592 6.5416 2.4402 3.5535 3.5730 3.1740 3.2891 3.4716 1.1309 1.2081 3.2298 1.3361 2.3117 1.7600 4.0097 3.0730 3.1582 1.7949 2.8661 3.3079 4.3218 2.5059 5.1971 4.6933 4.1111 2.9259 3.4580 5.8214 4.5749 4.0305 4.6523 3.7115 4.1322 6.4586 7.9388 5.8935 5.7935 6.0127 4.0193 1.2570 1.3073 3.4105 1.4336 2.9446 4.4062 4.3922 1.4380 1.4294 2.1985 3.6585 1.5517 1.5566 1.5758 1.3191 1.3197 1.3301 1.5692 2.4235 2.5276 1.6135 2.3929 3.2306 3.4495 2.3049 1.2661 1.6994 2.1456 1.3617 3.8010 1.5363 1.6764 1.0620 1.0707 1.8696 1.4648 3.7005 3.3865 3.3509 2.4307 1.4210 1.8084 1.7257 1.2667 1.3186 9.6447 1.1916 10.4148 1.2004 1.1038 1.1343 2.3891 2.3088 1.1475 1.2496 1.0488 1.1021 1.4302 1.2624 1.0587 1.0726 1.0968 1.9246 1.0926 1.1296 6.8242 7.8452 7.6953 7.0251 7.2535 1.0566 1.0572 1.0687 1.0347 1.0361 1.0728 1.0748 1.0908 1.0574 1.1006 1.1003 1.0990 1.1004 1.0999 1.0994 1.1069 1.0858 1.0856 1.0902 1.0914 1.0941 1.0967 1.0999 1.0954
irintensity: 0.4331 0.0973 0.2156 0.6019 2.2637 0.6815 0.8299 0.6803 1.2593 0.3572 2.2744 0.1071 1.7155 1.6099 0.6271 1.2752 4.3829 4.8054 0.1595 1.2201 7.6127 0.8664 0.5203 16.0827 1.0138 1.9409 1.6002 1.4434 1.5441 0.1301 2.2084 4.4851 16.3985 2.7937 1.3951 6.7171 11.8569 3.1201 6.0436 16.9500 23.9340 42.1012 26.6022 0.2336 5.2567 14.3559 2.2022 137.5217 4.3171 28.7336 25.7932 1.5297 1.2482 4.0912 18.0228 0.9444 3.2552 4.4462 0.0808 0.0948 0.0484 8.9780 20.0813 19.4201 30.7772 1.5856 70.0421 14.0019 9.3639 6.1621 7.3212 43.3965 8.9449 93.7057 6.1517 18.2959 1.5422 0.4367 37.7648 5.3033 202.4010 116.6490 33.0264 10.3791 4.3174 15.5312 57.6867 0.4625 8.1468 4.2803 11.8264 2.8416 12.3141 12.3447 7.5794 27.2208 29.1570 4.0361 33.6303 9.0989 9.1673 67.2087 11.8471 48.6084 15.4537 15.3758 24.0759 11.7511 16.8032 58.6348 144.3647 23.8918 29.5291 27.6225 101.4782 123.2602 84.3820 23.2133 25.6341 51.5297 50.8310 18.3682 20.6101 32.9150 0.5049 55.7274 24.7179 37.6624 20.0707 3.8314 1.8436 0.8256 15.8657 19.7050 20.7873 30.2086 15.4491 1.9752
temp: 298.150 k
press: 1.00000 atm
elementType: 16 8 7 7 6 6 6 6 6 6 6 6 6 6 6 6 6 6 6 6 6 6 6 6 1 1 1 1 1 1 1 1 1 1 1 1 1 1 1 1 1 1 1 1 1 1 1 1
symmnumber: 1
zpe: 1034406.6 jmol-1
zpe.correction: 0.393985 hartree
zpe.thermalcorrener: 0.417591 hartree
zpe.thermalcorrenthalpy: 0.418535 hartree
zpe.thermalcorrgfe: 0.340143 hartree
zpe.sumelectzpe: -1357.554997 hartree
zpe.sumelectthermal: -1357.531390 hartree
zpe.sumelectthermalent: -1357.530446 hartree
zpe.sumelectthermalfe: -1357.608839 hartree
dipole: 1.8315 -0.1934 1.7967
dipole: 2.5729
quadrupole: -140.9119 -142.4545 -145.4545
quadrupole: -1.4320 1.6538 1.2044
quadrupole: 2.0284 0.4858 -2.5142 -1.4320 1.6538 1.2044
hfenergy: -1357.9489817 hartree
pointgroup: C01 [X(C20H24N2O1S1)]
dipole: -0.7986212 0.0370938 0.6208796 debye
polarizability: 294.9767257|-0.3908173|278.5268366|-13.7877481|4.6482877|190.0292137 unknown
InChI: InChI=1S/C20H24N2OS/c1-20(2)15-9-5-7-11-17(15)22(18-12-8-6-10-16(18)20)19(23)24-14-13-21(3)4/h5-12H,13-14H2,1-4H3
charge 0 multiplicity 1
48 atoms
S  1.864451 1.798079 -0.488597
O  1.892633 -0.851294 -1.227958
N  -0.257113 0.06386 -0.991054
N  5.4040 0.100111 0.953956
C  -2.332047 -0.199941 0.892765
C  -2.211806 1.099879 0.0720
C  -2.020251 -1.367754 -0.069492
C  -1.124662 1.212223 -0.837421
C  -0.931464 -1.223778 -0.974834
C  -1.245347 -0.179595 2.025325
C  -3.71776 -0.345585 1.561562
C  -3.112227 2.185344 0.16796
C  -2.731726 -2.589605 -0.08011
C  -0.964198 2.355658 -1.651913
C  -0.551825 -2.267226 -1.846739
C  1.143327 0.128714 -0.987317
C  -2.93512 3.352705 -0.608448
C  -2.359198 -3.644884 -0.942945
C  -1.86043 3.436794 -1.521529
C  -1.264845 -3.484874 -1.821279
C  3.671441 1.238442 -0.402402
C  4.016794 0.619066 0.96552
C  5.514534 -1.238534 0.336488
C  6.073736 0.163808 2.267222
H  -0.228341 -0.054793 1.617761
H  -1.441281 0.658526 2.718451
H  -1.277285 -1.126084 2.594721
H  -3.9029 0.490758 2.258249
H  -4.535806 -0.371236 0.819388
H  -3.761792 -1.270621 2.162527
H  -3.962955 2.124742 0.85231
H  -3.583641 -2.728117 0.591968
H  -0.15073 2.395734 -2.381955
H  0.291705 -2.127642 -2.524926
H  -3.641072 4.184678 -0.511922
H  -2.921922 -4.584682 -0.929412
H  -1.730229 4.327743 -2.144758
H  -0.97123 -4.297914 -2.493865
H  3.807031 0.512995 -1.21975
H  4.271807 2.140502 -0.600639
H  3.93488 1.397838 1.745864
H  3.269738 -0.173953 1.210124
H  5.048219 -2.042313 0.960181
H  6.579352 -1.491805 0.184683
H  5.014761 -1.249605 -0.64633
H  5.614599 -0.507087 3.03747
H  6.047744 1.198329 2.653277
H  7.133649 -0.129603 2.155024
