program: Gaussian 09
title: 000071138
version: EM64L-G09RevD.01
frameworkgroup: C1[X(C23H28)]
method: RPBEPBE
basis: SDD
operation: Freq
keyword: #p
keyword: freq=noraman
keyword: PBEPBE/SDD
title: #p freq=noraman PBEPBE/SDD
converged: NO YES NO NO
title: Mulliken charges:
elementType: C C C C C C C C C C C C C C C C C C C C C C C H H H H H H H H H H H H H H H H H H H H H H H H H H H H
charge: 0.167747 0.187396 -0.492073 -0.491634 0.315024 0.331385 -0.747296 -0.744763 -0.745295 -0.745628 -0.603072 -0.423795 0.385153 -0.486810 0.223294 -0.841043 -0.418485 0.424901 -0.390291 -0.403176 -0.246320 -0.244007 -0.245831 0.207342 0.201063 0.208245 0.200298 0.211866 0.225510 0.225621 0.211848 0.222446 0.213054 0.208944 0.223992 0.212768 0.226493 0.222269 0.212265 0.249091 0.224462 0.223913 0.250534 0.234215 0.234019 0.226986 0.249900 0.231579 0.223535 0.224574 0.227790
chargesum: 0.00000
title: Mulliken charges with hydrogens summed into heavy atoms:
elementType: C C C C C C C C C C C C C C C C C C C C C C C
charge: 0.167747 0.187396 -0.083668 -0.083092 0.315024 0.331385 -0.084299 -0.097416 -0.099590 -0.084601 -0.353981 -0.199333 0.385153 -0.262897 0.223294 -0.122276 -0.191499 0.424901 -0.140391 -0.171598 -0.022785 -0.019433 -0.018041
polarizability: 4.15165284e+02 -2.64489743e+01 2.25839425e+02 2.41833426e+00 1.55173601e+01 1.77562520e+02
1716.lowfreq: -4.6524 -0.0004 -0.0003 0.0008 3.3525 9.6070 23.7672 30.1978 46.6241
frequency: 23.6381 30.1943 46.6019 49.0638 64.4321 89.4243 124.7880 137.0508 165.8781 186.7134 195.8670 209.8914 214.1690 224.7984 248.2699 254.7153 266.1555 272.3283 292.6077 310.7394 333.3177 336.5735 349.3237 360.3354 381.2811 382.3161 410.7887 436.2518 458.7311 467.3321 501.0539 506.7627 522.2825 535.9098 548.4172 586.0537 609.0620 616.1868 642.6331 674.4787 697.8730 703.7833 753.6018 770.8405 773.6518 814.7134 825.3539 833.1682 848.9287 866.1609 876.0494 887.0236 916.3198 925.4554 927.1404 929.6521 934.9443 955.6593 959.7819 968.2974 975.1344 984.1708 990.8040 993.1513 1002.4789 1022.3152 1028.3095 1035.0049 1055.6530 1062.0639 1077.7236 1083.1931 1088.4162 1114.5409 1163.2630 1171.5405 1183.1792 1191.5777 1192.1676 1196.2613 1217.5365 1220.9367 1240.0781 1259.9159 1267.0083 1294.2249 1302.6378 1319.3862 1341.4820 1343.8858 1347.0865 1365.1877 1374.1167 1376.2703 1385.1790 1390.7229 1394.0029 1396.7084 1407.3889 1435.4629 1454.3528 1460.1606 1463.8266 1466.9112 1468.4391 1471.6664 1475.4004 1477.6569 1481.8459 1482.3159 1482.9657 1487.4205 1491.5860 1496.4943 1555.8570 1577.5024 1604.7129 1610.5724 1626.4528 2969.6838 2970.7145 2971.3145 2972.9248 2973.3254 2975.2714 2980.5315 3022.2280 3033.6730 3058.2232 3063.0730 3063.4652 3068.1541 3069.3958 3075.1086 3076.1606 3079.4419 3080.5504 3085.0808 3096.5568 3116.0712 3122.5799 3125.2825 3133.3340 3139.0752 3148.2345 3156.6611 3170.1418
redmass: 3.7906 3.5676 3.9339 2.9066 2.9769 3.6496 3.1425 3.6500 2.6916 1.9858 1.2126 1.6117 1.4728 1.6290 1.1052 1.2453 2.7329 2.5810 2.4186 2.6929 2.6852 2.8281 2.9527 2.9446 2.8805 2.4767 2.8232 3.1113 2.9420 3.5622 2.8963 3.3504 2.5952 3.0097 3.3022 3.5621 3.4187 5.9141 3.5930 5.2889 3.0575 2.0355 2.0667 2.8448 2.7679 3.3774 2.2424 1.6327 1.2619 3.1078 1.4204 1.9997 1.5747 1.5314 1.5164 1.5245 1.7208 1.5816 1.5873 1.4935 1.4126 3.3620 1.8807 1.7189 1.2659 1.4616 1.9627 1.5600 2.3198 2.0652 1.9755 1.6528 1.8252 1.8295 1.6886 1.0587 3.1954 1.5597 1.2072 2.1510 2.4228 2.5774 1.8964 2.3477 1.8567 1.8149 2.0882 1.8260 1.7597 1.4408 1.5410 4.2904 1.1943 1.1887 3.7820 1.4773 1.2301 1.2298 2.0659 2.2371 1.0659 1.0604 1.0544 1.0917 1.0866 1.1003 1.2828 1.1037 1.0607 1.7997 1.0876 1.0955 1.0917 1.7702 6.5141 5.6686 6.0208 6.0728 6.7324 1.0369 1.0431 1.0461 1.0427 1.0401 1.0400 1.0558 1.0997 1.1024 1.0893 1.0992 1.0994 1.0986 1.0983 1.1000 1.0998 1.0991 1.0991 1.0878 1.0992 1.0861 1.0858 1.0870 1.0891 1.0934 1.0953 1.0970 1.0974
irintensity: 0.0223 0.0074 0.0920 0.0262 0.6771 0.5900 0.3066 0.0860 0.0874 0.3293 0.2578 0.0483 0.0255 0.0674 0.0500 0.0979 0.0283 0.0985 0.2860 0.6702 0.2525 0.6167 0.1066 0.3335 0.5518 0.1159 0.1468 4.0430 0.2840 1.1707 0.7832 3.3051 14.9919 7.4910 2.6535 2.2448 2.6200 0.1861 2.5977 0.2365 15.1906 35.6648 23.3461 7.8905 14.6318 5.4533 5.5214 27.8447 0.5293 8.4199 12.6337 1.7084 9.9821 10.2495 2.8081 0.0607 3.4271 0.7700 1.1967 0.5375 0.3054 8.4665 5.3490 3.9402 0.6676 5.2367 1.8150 4.6312 16.8096 7.6954 12.7178 4.2439 8.5789 24.1461 1.3759 0.0484 0.9116 4.0344 2.7784 4.7281 5.5296 0.8953 3.5208 8.1141 7.5513 14.0752 11.3516 0.4615 0.6537 2.9873 4.1331 2.9669 6.8574 32.5283 2.5235 8.5056 1.9650 23.4401 19.6167 7.5486 0.0315 0.4157 1.1917 1.7784 8.2080 6.4896 5.9450 14.0017 34.4813 15.3614 16.5396 4.6093 15.2189 57.2591 5.3683 2.1695 12.1292 12.4169 15.0085 14.0098 4.3314 50.5689 22.3849 2.1131 86.1204 70.9441 43.3456 49.0610 18.8788 3.6669 6.5510 46.4328 138.2250 8.4482 34.4550 66.5328 22.0152 21.8556 23.0854 10.8205 17.6350 0.2777 15.0872 30.3760 24.7867 45.7557 15.5234
temp: 298.150 k
press: 1.00000 atm
elementType: 6 6 6 6 6 6 6 6 6 6 6 6 6 6 6 6 6 6 6 6 6 6 6 1 1 1 1 1 1 1 1 1 1 1 1 1 1 1 1 1 1 1 1 1 1 1 1 1 1 1 1
symmnumber: 1
zpe: 1154141.4 jmol-1
zpe.correction: 0.439589 hartree
zpe.thermalcorrener: 0.462038 hartree
zpe.thermalcorrenthalpy: 0.462982 hartree
zpe.thermalcorrgfe: 0.388332 hartree
zpe.sumelectzpe: -891.565127 hartree
zpe.sumelectthermal: -891.542679 hartree
zpe.sumelectthermalent: -891.541735 hartree
zpe.sumelectthermalfe: -891.616384 hartree
dipole: 1.0323 0.0995 -0.2261
dipole: 1.0614
quadrupole: -128.5128 -134.5705 -139.7416
quadrupole: 0.4839 2.1777 3.6320
quadrupole: 5.7622 -0.2955 -5.4666 0.4839 2.1777 3.6320
hfenergy: -892.0047165 hartree
pointgroup: C01 [X(C23H28)]
dipole: 0.4072589 -0.0563938 0.0731568 debye
polarizability: 414.3317993|29.2360648|214.4040155|4.1716568|26.1370391|189.831414 unknown
InChI: InChI=1S/C23H28/c1-17(15-18-9-7-6-8-10-18)19-11-12-20-21(16-19)23(4,5)14-13-22(20,2)3/h6-12,15-16H,13-14H2,1-5H3
charge 0 multiplicity 1
51 atoms
C  2.581332 -1.817494 -0.139633
C  4.295131 0.786412 -0.105391
C  4.043272 -1.712528 -0.659292
C  4.863488 -0.648128 0.085891
C  1.968195 -0.407103 0.030414
C  2.760214 0.782817 0.069355
C  2.556463 -2.551056 1.236461
C  1.777366 -2.665518 -1.166937
C  4.983951 1.711173 0.939008
C  4.637424 1.3101 -1.534466
C  0.564968 -0.297988 0.202951
C  2.087472 2.0219 0.246243
C  -0.109799 0.93835 0.379052
C  0.69404 2.111161 0.403537
C  -1.597929 0.982451 0.525544
C  -2.179697 2.021975 1.47084
C  -2.368992 0.103055 -0.204428
C  -3.828722 -0.115506 -0.193603
C  -4.668095 0.093556 0.942113
C  -4.440915 -0.622297 -1.379999
C  -6.054714 -0.161539 0.878411
C  -5.826413 -0.871033 -1.446317
C  -6.645214 -0.63612 -0.316002
H  4.026157 -1.478076 -1.742429
H  4.52556 -2.705143 -0.560028
H  4.886445 -0.886302 1.168073
H  5.915189 -0.661883 -0.262119
H  2.956074 -3.577966 1.130945
H  3.160893 -2.019484 1.992905
H  1.524743 -2.621333 1.625949
H  0.761376 -2.910618 -0.809645
H  1.68283 -2.134769 -2.132005
H  2.302262 -3.622568 -1.349774
H  4.75389 2.778838 0.77431
H  4.674578 1.4484 1.96708
H  6.082556 1.5966 0.869295
H  4.217338 0.655643 -2.318859
H  4.224083 2.322931 -1.691669
H  5.734471 1.359984 -1.673566
H  -0.035765 -1.213746 0.228537
H  2.671574 2.949107 0.261171
H  0.233384 3.098613 0.514581
H  -3.217541 2.283352 1.207258
H  -1.580855 2.948428 1.461002
H  -2.172284 1.65895 2.518062
H  -1.836527 -0.504659 -0.951093
H  -4.22881 0.415016 1.890589
H  -3.813085 -0.809019 -2.260335
H  -6.675174 -0.001147 1.767753
H  -6.268167 -1.250893 -2.374625
H  -7.722217 -0.832294 -0.361715
