program: Gaussian 09
title: 000071113
version: EM64L-G09RevD.01
frameworkgroup: C1[X(C8H17NO)]
method: RPBEPBE
basis: SDD
operation: Freq
keyword: #p
keyword: freq=noraman
keyword: PBEPBE/SDD
title: #p freq=noraman PBEPBE/SDD
converged: YES YES NO NO
title: Mulliken charges:
elementType: O N C C C C C C C C H H H H H H H H H H H H H H H H H
charge: -0.267213 -0.621959 -0.146425 -0.414521 -0.397888 -0.367239 -0.370951 0.204121 -0.697848 -0.697295 0.189470 0.238204 0.186801 0.195613 0.202642 0.221732 0.181345 0.213012 0.241104 0.218056 0.214574 0.205085 0.206382 0.219217 0.204554 0.310976 0.328450
chargesum: 0.00000
title: Mulliken charges with hydrogens summed into heavy atoms:
elementType: O N C C C C C C C C
charge: -0.267213 0.017467 0.043045 0.010483 0.000367 0.035838 0.083165 0.204121 -0.060132 -0.067143
polarizability: 1.01772924e+02 4.40021701e-01 9.78270148e+01 -1.38182469e+00 -3.47645844e+00 8.81437072e+01
1716.lowfreq: -11.4145 -0.0002 -0.0002 0.0004 6.6891 12.8284 32.6103 62.8148 76.4350
frequency: 32.5062 62.7597 76.4042 78.9313 90.1085 120.9782 216.3825 222.4708 232.3875 243.0214 287.7287 297.8657 327.6567 459.0875 499.2451 504.2610 585.4486 628.4976 716.0524 736.8550 746.6530 777.3986 850.0071 858.8350 902.0283 907.1744 982.3625 1029.0826 1041.6479 1052.4249 1062.8171 1079.7375 1112.3874 1132.8488 1154.0174 1222.5690 1229.2669 1239.3420 1268.6126 1290.4259 1293.9814 1304.3506 1321.0660 1353.9042 1362.1442 1381.1225 1388.0993 1388.7673 1455.1578 1463.0482 1470.4913 1475.5238 1477.1695 1478.0262 1485.2453 1488.6505 1590.3544 1635.7119 2944.9142 2961.5627 2964.3625 2968.9002 2972.1991 2975.0405 2994.0199 3007.6655 3014.4669 3041.7288 3050.6316 3069.1331 3070.9194 3071.3552 3073.4161 3513.0164 3670.4950
redmass: 4.6122 2.2332 2.1922 2.4450 2.0459 3.4103 1.5791 2.4872 1.4141 1.2499 3.0359 3.1651 2.7734 2.6653 2.1375 1.3470 1.6899 1.9937 2.1055 1.3937 1.3419 2.2148 1.7817 1.3655 1.6923 1.4085 2.3108 2.1212 1.6405 1.9763 2.1163 2.1324 1.8143 2.3392 2.2769 1.3650 1.4180 1.2918 1.7802 1.3055 1.1633 1.1298 1.3364 1.5291 1.5265 1.8928 1.2402 1.2157 1.0785 1.0827 1.0712 1.0460 1.0431 1.0443 1.0660 1.0897 1.5086 3.1093 1.0739 1.0612 1.0629 1.0394 1.0391 1.0616 1.0621 1.0991 1.0959 1.1006 1.1004 1.1002 1.1016 1.0993 1.1000 1.0445 1.1042
irintensity: 12.5975 0.2014 0.6613 0.7346 0.7066 2.6279 0.4292 1.5889 0.9236 0.5781 4.1528 2.2025 1.0680 2.0430 18.9732 171.0315 56.8389 32.4755 12.0708 17.2932 6.7309 2.6394 0.6276 0.8520 7.4584 1.8974 4.8080 2.3882 2.1315 1.9216 2.0748 3.3665 10.2712 1.8762 4.6525 10.0282 5.5320 2.2024 76.1403 6.9604 15.7803 1.1142 7.7186 4.4351 7.4551 44.1195 16.2537 5.8095 7.1366 3.4411 5.0188 4.1008 8.6666 13.6894 13.0137 11.4251 53.9762 248.4496 17.0916 4.5088 75.2040 61.7478 22.5603 46.3683 21.9789 25.9293 9.2344 0.7556 11.1386 61.0397 91.2300 49.2489 62.8153 26.9128 20.2309
temp: 298.150 k
press: 1.00000 atm
elementType: 8 7 6 6 6 6 6 6 6 6 1 1 1 1 1 1 1 1 1 1 1 1 1 1 1 1 1
symmnumber: 1
zpe: 631239.0 jmol-1
zpe.correction: 0.240426 hartree
zpe.thermalcorrener: 0.253343 hartree
zpe.thermalcorrenthalpy: 0.254287 hartree
zpe.thermalcorrgfe: 0.200360 hartree
zpe.sumelectzpe: -444.212971 hartree
zpe.sumelectthermal: -444.200054 hartree
zpe.sumelectthermalent: -444.199110 hartree
zpe.sumelectthermalfe: -444.253037 hartree
dipole: 0.4321 0.9776 -3.6154
dipole: 3.7701
quadrupole: -64.8257 -55.4128 -66.3538
quadrupole: 1.3304 0.2128 -6.1456
quadrupole: -2.6282 6.7846 -4.1564 1.3304 0.2128 -6.1456
hfenergy: -444.453397 hartree
pointgroup: C01 [X(C8H17N1O1)]
dipole: -0.1760941 0.3330833 1.4346055 debye
polarizability: 101.7851143|-0.3891541|97.5644289|-1.3636039|3.8063913|88.3941023 unknown
InChI: InChI=1S/C8H17NO/c1-3-5-7(6-4-2)8(9)10/h7H,3-6,9H2,1-2H3
charge 0 multiplicity 1
27 atoms
O  0.050137 1.427006 -1.41794
N  -0.223006 2.614754 0.550253
C  0.013032 0.154063 0.708744
C  1.024946 -0.860508 0.124463
C  -1.427402 -0.440086 0.852104
C  2.497938 -0.426583 0.297757
C  -2.057085 -0.972312 -0.456541
C  -0.03519 1.43181 -0.152984
C  3.489459 -1.456109 -0.285559
C  -3.503864 -1.465109 -0.237799
H  0.350898 0.437039 1.729621
H  0.813158 -0.990014 -0.953324
H  0.86868 -1.844095 0.61368
H  -2.098305 0.33202 1.283425
H  -1.381077 -1.265756 1.592134
H  2.649089 0.551026 -0.201441
H  2.714193 -0.272128 1.375711
H  -1.441974 -1.802717 -0.853104
H  -2.039304 -0.178988 -1.226925
H  3.314509 -1.598605 -1.368313
H  4.537451 -1.130189 -0.152418
H  3.375812 -2.441282 0.205811
H  -4.154612 -0.643703 0.118509
H  -3.940146 -1.856966 -1.174826
H  -3.542727 -2.274199 0.516821
H  -0.266519 2.637762 1.567349
H  -0.308191 3.486469 0.027291
