program: Gaussian 09
title: 000005957
version: EM64L-G09RevD.01
frameworkgroup: C1[X(C10H16N5O13P3)]
method: RPBEPBE
basis: SDD
operation: Freq
keyword: #p
keyword: freq=noraman
keyword: PBEPBE/SDD
title: #p freq=noraman PBEPBE/SDD
converged: YES YES NO NO
title: Mulliken charges:
elementType: P P P O O O O O O O O O O O O O N N N N N C C C C C C C C C C H H H H H H H H H H H H H H H H
charge: 1.489886 1.507212 1.491699 -0.249664 -0.444058 -0.526836 -0.510456 -0.811226 -0.646850 -0.548768 -0.745298 -0.684675 -0.513485 -0.761598 -0.739463 -0.530303 -0.165144 -0.086148 -0.090892 -0.059786 -0.607767 -0.186892 -0.200670 -0.052181 -0.031012 -0.388896 0.190217 -0.197904 -0.105183 0.172778 -0.359943 0.320686 0.261959 0.219829 0.270847 0.276251 0.311349 0.362692 0.433657 0.269033 0.245696 0.346609 0.335020 0.419711 0.451909 0.435130 0.432929
chargesum: 0.00000
title: Mulliken charges with hydrogens summed into heavy atoms:
elementType: P P P O O O O O O O O O O O O O N N N N N C C C C C C C C C C
charge: 1.489886 1.507212 1.491699 -0.249664 -0.081366 -0.093180 -0.510456 -0.811226 -0.227139 -0.548768 -0.745298 -0.232767 -0.513485 -0.326468 -0.306534 -0.530303 -0.165144 -0.086148 -0.090892 -0.059786 0.073862 0.133794 0.061288 0.167648 0.239835 0.198704 0.190217 0.071129 -0.105183 0.172778 -0.114247
polarizability: 3.51699498e+02 -2.19040892e+01 2.58924505e+02 -8.04426862e+00 -2.06629896e+01 1.88380869e+02
1716.lowfreq: -6.9039 -0.0016 -0.0014 0.0007 0.4178 3.1723 9.2545 19.3295 23.8247
frequency: 7.1543 19.2660 23.7401 31.0228 35.0977 39.9299 42.5584 57.4706 60.0999 75.7615 77.6468 82.2907 102.3922 122.5618 134.9043 140.1619 149.1961 160.4577 187.6834 196.0558 203.1369 208.8054 210.2639 225.7937 236.4072 248.9108 254.3117 264.5577 274.0436 279.6852 297.3744 313.1617 323.3799 332.2330 345.2696 351.5515 355.9206 367.1790 367.6751 370.7130 389.5630 408.7598 415.1010 440.0023 482.7088 505.8443 511.2581 524.1534 525.7406 534.9261 550.0900 550.9580 564.9044 582.7219 593.4102 611.7491 644.4355 647.0066 667.7201 670.6324 672.1310 691.5617 699.8021 729.2407 730.4269 756.5381 777.6870 789.0556 793.5498 822.4251 826.1617 835.1944 854.9261 863.7313 876.6594 906.0243 913.1670 929.9854 960.6442 963.0698 1014.4419 1024.3877 1025.4465 1031.0642 1042.9078 1047.9327 1061.6655 1087.6900 1091.4775 1096.8966 1106.1747 1121.0399 1157.1111 1166.9976 1181.1255 1212.4752 1214.0390 1225.8667 1231.4594 1249.3960 1261.8702 1279.1476 1300.4581 1308.8937 1315.3846 1321.7058 1328.7898 1360.5882 1378.1428 1382.3477 1388.0714 1395.1401 1412.8810 1439.7619 1465.1314 1482.6810 1542.9635 1580.4207 1634.6954 3013.3783 3026.5397 3037.0802 3069.6213 3087.4072 3098.7550 3164.8920 3231.4984 3343.0680 3352.1857 3377.4470 3538.7414 3583.0696 3598.3889 3619.9282 3693.5867
redmass: 8.7061 9.0174 7.9080 7.0976 7.7994 12.2411 9.7621 6.8431 6.8407 6.9481 4.9458 2.4298 6.9390 7.2938 8.0032 8.0869 7.7249 8.6386 5.8959 5.6882 5.7113 3.8871 4.3780 5.2987 7.9436 3.2182 4.8455 4.2358 5.0274 3.9092 5.4839 5.9065 5.6982 4.9295 4.1728 4.1435 2.5011 4.3398 2.5915 4.2352 6.2895 6.2533 11.9010 6.6500 5.0017 7.5665 8.6915 2.8488 1.5394 7.9840 3.3819 1.1076 4.0078 1.2646 4.1163 1.3725 4.2964 4.7533 3.8748 8.5110 7.6913 4.3724 7.3087 7.3098 10.7046 7.3286 2.6813 8.7290 4.1538 3.8327 1.9053 3.6020 10.6788 7.8952 3.4679 3.7233 4.5089 1.4309 3.0633 3.4406 3.4735 2.5508 2.3543 1.4587 3.4776 2.8886 1.4777 4.9169 3.3186 9.8192 2.1245 2.5372 4.4444 1.1424 1.9761 1.3903 1.2009 1.6392 1.8879 1.3418 2.1908 1.2548 5.3127 1.2625 1.5366 4.2405 1.3728 2.0341 1.2521 1.8887 1.2735 2.6857 1.3539 2.7349 3.9881 1.0802 6.5596 1.8613 2.8341 1.0588 1.0860 1.0873 1.0881 1.0878 1.1098 1.0921 1.0986 1.0656 1.0686 1.0640 1.0443 1.0662 1.0664 1.0667 1.1056
irintensity: 0.2833 0.2031 2.0159 5.1357 4.2043 2.2669 1.4588 3.0099 0.5434 4.0281 24.0349 53.8425 10.4235 4.2035 6.0363 0.7549 9.2285 7.5611 5.6048 19.7346 4.0770 13.2727 11.0882 10.8667 11.1470 15.5266 22.1430 12.9097 19.1373 24.1193 24.1739 48.3414 10.1836 43.9588 10.4171 13.4922 94.1760 84.5337 91.6961 30.3932 72.1155 21.3444 28.6429 13.8041 37.3516 53.6778 5.4428 72.4056 199.9419 19.1170 12.9379 1.6816 0.5554 125.8732 11.1044 119.8187 5.8750 57.7906 37.3354 23.8456 6.7674 226.5715 27.1251 74.9367 272.9376 316.9547 114.3919 424.9870 56.5412 18.6427 16.1531 10.1272 412.0689 10.2965 38.3290 105.9536 297.4575 11.4785 94.5843 105.1568 46.7724 55.9294 97.3321 21.1537 80.7369 73.6148 125.1134 152.5749 4.2330 158.9157 7.8374 229.5123 19.8166 223.0503 34.7548 7.1108 10.1646 74.6916 56.7306 53.4969 27.3090 16.0811 37.7015 12.9264 26.3411 64.6404 8.2088 115.0848 12.7373 4.9587 54.9695 14.7688 41.6489 67.7494 30.4762 13.6597 59.3576 29.3251 680.0576 20.6164 25.4653 8.9937 32.6306 2.4725 19.2898 11.7901 0.0225 206.4223 818.4055 5.7526 145.9824 118.0486 132.0828 106.9944 50.9419
temp: 298.150 k
press: 1.00000 atm
elementType: 15 15 15 8 8 8 8 8 8 8 8 8 8 8 8 8 7 7 7 7 7 6 6 6 6 6 6 6 6 6 6 1 1 1 1 1 1 1 1 1 1 1 1 1 1 1 1
symmnumber: 1
zpe: 817012.1 jmol-1
zpe.correction: 0.311183 hartree
zpe.thermalcorrener: 0.344240 hartree
zpe.thermalcorrenthalpy: 0.345184 hartree
zpe.thermalcorrgfe: 0.242794 hartree
zpe.sumelectzpe: -2663.626501 hartree
zpe.sumelectthermal: -2663.593445 hartree
zpe.sumelectthermalent: -2663.592501 hartree
zpe.sumelectthermalfe: -2663.694891 hartree
dipole: 0.6272 -5.1184 -0.8504
dipole: 5.2264
quadrupole: -205.5641 -200.3859 -203.4978
quadrupole: -19.2948 -9.2357 -15.2951
quadrupole: -2.4148 2.7633 -0.3485 -19.2948 -9.2357 -15.2951
hfenergy: -2663.9376847 hartree
pointgroup: C01 [X(C10H16N5O13P3)]
dipole: -0.9672858 -0.8853713 1.5838132 debye
polarizability: 295.6518941|-48.8195089|206.4662174|36.5368063|-35.6934844|296.8867614 unknown
InChI: InChI=1S/C10H16N5O13P3/c11-8-5-9(13-2-12-8)15(3-14-5)10-7(17)6(16)4(26-10)1-25-30(21,22)28-31(23,24)27-29(18,19)20/h2-4,6-7,10,16-19,21,23H,1,11H2
charge 0 multiplicity 1
47 atoms
P  3.274344 -0.241963 -1.385101
P  4.465565 -0.673459 1.572307
P  3.022327 -2.625075 3.601065
O  -1.076807 1.25234 0.550119
O  -2.938155 -1.784463 1.331082
O  -0.573916 -1.322104 2.326468
O  1.688978 -0.73708 -1.022117
O  4.291197 -0.900311 -0.083897
O  3.743164 -1.423857 -2.512688
O  3.508607 1.285764 -1.700093
O  3.761139 -2.22093 2.135411
O  3.206889 0.427528 1.914384
O  5.916659 -0.427231 2.122761
O  2.727523 -1.009704 4.157669
O  1.413421 -3.036615 3.107765
O  3.695588 -3.649588 4.590524
N  -3.292917 1.08846 -0.371813
N  -5.042845 2.322639 -1.211984
N  -2.376581 0.198852 -2.52385
N  -3.677177 0.972082 -4.463707
N  -5.551977 2.396648 -4.263613
C  -2.088661 -0.980356 0.480115
C  -0.584401 -1.106548 0.875741
C  -2.374024 0.54911 0.627486
C  0.027252 0.253088 0.488532
C  0.58356 0.2868 -0.943268
C  -3.252979 0.925241 -1.765465
C  -4.381462 1.94233 -0.108369
C  -4.342515 1.692035 -2.258938
C  -4.538304 1.696455 -3.6711
C  -2.667038 0.279448 -3.859271
H  -2.250444 -1.300446 -0.560155
H  -0.081494 -1.935796 0.345918
H  -2.822119 0.747707 1.618872
H  0.799729 0.566231 1.209558
H  0.975388 1.290547 -1.184485
H  -0.173003 -0.018222 -1.686447
H  -2.441338 -1.841309 2.200241
H  0.172391 -1.931875 2.594943
H  -4.636833 2.238413 0.907171
H  -2.007659 -0.279469 -4.530009
H  -6.196341 2.937825 -3.690768
H  -5.645796 2.368573 -5.276852
H  4.639473 -1.815629 -2.345356
H  2.885309 0.348007 2.864877
H  2.479716 -0.899588 5.109099
H  1.225467 -4.008808 3.063639
