program: Gaussian 09
title: 000071122
version: EM64L-G09RevD.01
frameworkgroup: C1[X(C10H14N2O4)]
method: RPBEPBE
basis: SDD
operation: Freq
keyword: #p
keyword: freq=noraman
keyword: PBEPBE/SDD
title: #p freq=noraman PBEPBE/SDD
converged: YES YES NO NO
title: Mulliken charges:
elementType: O O O O N N C C C C C C C C C C H H H H H H H H H H H H H H
charge: -0.204286 -0.265115 -0.192015 -0.225612 -0.440229 -0.649715 -0.002926 -0.514494 -0.018751 -0.530531 0.208864 0.216459 -0.696523 -0.036614 -0.574273 0.278944 0.263219 0.251616 0.235935 0.226597 0.254632 0.242170 0.223102 0.232622 0.246161 0.352529 0.221200 0.226970 0.346617 0.323449
chargesum: 0.00000
title: Mulliken charges with hydrogens summed into heavy atoms:
elementType: O O O O N N C C C C C C C C C C
charge: -0.204286 -0.265115 -0.192015 -0.225612 -0.087700 0.020351 -0.002926 0.000341 0.217184 -0.049302 0.208864 0.216459 0.001371 0.209547 -0.126104 0.278944
polarizability: 1.67312573e+02 9.87598173e+00 1.04800318e+02 6.84383664e+00 7.24031482e-01 1.24407822e+02
1716.lowfreq: -10.4582 -6.0981 -0.0004 0.0005 0.0010 4.9102 28.4029 39.7028 55.1948
frequency: 28.3652 39.6678 55.1450 61.8037 71.1718 108.1369 113.8418 143.6886 168.9450 203.7032 210.7147 236.0875 256.2308 280.0284 308.8180 339.9587 361.8611 410.0365 427.9146 441.4591 454.5566 541.5478 543.8278 571.1181 599.0799 614.2132 662.6264 676.1071 724.8759 759.1398 782.0211 826.4759 836.7296 880.7712 887.6841 901.7381 917.0749 940.1564 963.4207 981.6793 986.0334 999.6945 1052.8301 1063.3496 1096.7446 1116.9535 1130.3511 1143.0296 1162.1820 1199.9353 1208.5451 1245.5131 1293.7274 1296.0054 1303.1967 1309.8983 1316.4463 1355.1708 1395.0811 1428.9189 1454.8207 1459.2103 1469.3189 1475.3126 1508.9288 1617.3947 1619.4720 1658.9003 1668.8097 1699.0074 2968.0586 2995.0428 3016.5391 3033.2803 3047.2392 3090.1241 3092.0945 3102.0033 3107.7549 3109.1849 3201.0254 3301.2082 3531.4111 3689.1011
redmass: 7.9810 4.5182 4.0699 3.2677 3.1309 5.1781 4.1484 5.3834 3.1597 1.2315 3.6204 5.6663 3.2995 3.0701 3.5647 3.8328 4.7172 2.2648 1.4355 2.3357 2.5721 1.2986 3.0363 4.6434 3.8053 2.1014 4.9254 8.2028 7.3846 3.8496 3.8367 1.2489 3.9770 2.1666 3.1837 2.2866 2.4767 1.6310 1.3325 1.9822 2.5637 1.1695 2.2586 2.0316 2.9868 4.0281 2.4208 1.9366 2.6249 1.7196 2.1731 1.3740 1.2868 1.4803 1.4493 2.1013 1.6753 1.5491 1.2409 1.1627 1.1053 1.0566 1.0785 1.0518 2.1568 1.2431 7.6420 4.5582 3.7049 6.0753 1.0625 1.0363 1.0865 1.0628 1.0985 1.0608 1.0989 1.1026 1.0940 1.1012 1.1147 1.0813 1.0459 1.1042
irintensity: 1.0931 15.4739 0.0173 0.7845 1.9476 13.6443 4.2103 1.7365 2.5551 0.2091 0.0294 5.0897 0.2132 3.2506 0.0190 8.2435 0.7387 16.5549 66.5407 5.5079 3.0779 181.9767 62.2306 2.1512 13.7450 6.4503 6.4987 1.4175 20.6300 2.6851 3.1467 132.7772 19.1870 26.8497 7.3394 2.9994 13.0209 11.1651 74.1726 30.4494 39.9466 18.0699 15.4743 6.7482 219.8501 1.2219 30.6596 3.2132 91.5747 23.3897 92.3304 52.6360 2.5668 39.6183 65.1585 119.5498 71.7855 14.6996 26.7118 4.5461 15.1240 2.8283 18.9127 11.4470 752.1650 31.6016 94.2202 12.1885 187.3413 334.7011 24.8717 14.0411 22.5059 9.7411 5.1141 7.0488 14.6136 9.6555 6.9507 27.4764 17.3742 206.8171 45.9887 40.5609
temp: 298.150 k
press: 1.00000 atm
elementType: 8 8 8 8 7 7 6 6 6 6 6 6 6 6 6 6 1 1 1 1 1 1 1 1 1 1 1 1 1 1
symmnumber: 1
zpe: 618177.9 jmol-1
zpe.correction: 0.235452 hartree
zpe.thermalcorrener: 0.252219 hartree
zpe.thermalcorrenthalpy: 0.253163 hartree
zpe.thermalcorrgfe: 0.189842 hartree
zpe.sumelectzpe: -798.662813 hartree
zpe.sumelectthermal: -798.646045 hartree
zpe.sumelectthermalent: -798.645101 hartree
zpe.sumelectthermalfe: -798.708422 hartree
dipole: -3.5434 1.6517 2.2652
dipole: 4.5183
quadrupole: -83.3054 -92.4728 -104.2987
quadrupole: 3.4866 23.4936 -7.6787
quadrupole: 10.0536 0.8862 -10.9398 3.4866 23.4936 -7.6787
hfenergy: -798.8982647 hartree
pointgroup: C01 [X(C10H14N2O4)]
dipole: -1.5206112 -0.524647 -0.7566491 debye
polarizability: 154.3527124|-27.2013429|121.1202709|6.4077346|4.1429255|121.0477296 unknown
InChI: InChI=1S/C10H14N2O4/c1-3-4-10(7(13)12-9(11)15)5-6(2)16-8(10)14/h3,6,12H,1,4-5,11H2,2H3
charge 0 multiplicity 1
30 atoms
O  -2.091671 0.567631 -1.180599
O  -0.173927 -0.666069 -1.546302
O  1.111816 1.539087 1.975297
O  3.845957 0.570106 1.393276
N  1.813995 0.104502 0.230771
N  3.879928 -0.445579 -0.704679
C  -0.605126 0.36469 0.70497
C  -1.56142 1.558795 0.96228
C  -2.725903 1.336641 -0.030248
C  -1.00301 -0.865196 1.625007
C  -0.885482 0.017156 -0.769466
C  0.872672 0.744196 1.031685
C  -3.369902 2.59376 -0.602407
C  -0.322562 -2.178856 1.304005
C  0.509601 -2.82819 2.15547
C  3.236729 0.123485 0.392207
H  -1.044256 2.510563 0.749148
H  -1.909295 1.596427 2.006538
H  -3.491361 0.653853 0.384345
H  -2.103089 -0.989981 1.549046
H  -0.774619 -0.561531 2.663417
H  -4.137668 2.338639 -1.352019
H  -3.853645 3.165926 0.210223
H  -2.611833 3.238592 -1.079169
H  -0.550989 -2.626186 0.325971
H  1.412255 -0.46224 -0.5372
H  0.961917 -3.790419 1.891205
H  0.770642 -2.412029 3.136498
H  4.89467 -0.505551 -0.662676
H  3.399675 -0.731523 -1.556394
