program: Orca
programVersion: 5.0.2
elementType: Cl Cl O O N N N C C C C C C C C C C C C H H H H H H H H H H H H
charge: 1
multiplicity: 1
keywords: wb97x-d3
keywords: def2-TZVPP
keywords: def2/J RIJCOSX
keywords: DEFGRID2
keywords: scfconv7
keywords: smallprint printgap noloewdin
keywords: NOSOSCF
formula: C12H12Cl2N3O2
InChI: InChI=1/C12H12Cl2N3O2/c13-9-1-2-10(11(14)5-9)12(18-3-4-19-12)6-17-8-15-7-16-17/h1-2,5,7-8,15H,3-4,6H2
31 atoms
Cl -0.638532 -1.319027 2.447303
Cl -4.347352 0.905915 -0.659345
O  1.379918 -2.374801 0.583588
O  1.913972 -1.242014 -1.279183
N  2.031877 1.219898 0.325451
N  2.662698 1.61546 -0.792452
N  1.437614 3.220414 0.016691
C  1.316113 -1.118961 -0.028661
C  2.15147 -0.13843 0.813475
C  -0.130305 -0.641554 -0.156981
C  1.896478 -3.321613 -0.347827
C  1.769606 -2.601079 -1.67258
C  -1.053699 -0.69366 0.886474
C  -0.554327 -0.069429 -1.353475
C  -2.350977 -0.226498 0.738371
C  -1.841549 0.409769 -1.526475
C  1.283515 2.179389 0.821537
C  -2.73413 0.320225 -0.473654
C  2.290351 2.84132 -0.967038
H  3.203118 -0.421217 0.784941
H  1.819957 -0.144376 1.849048
H  1.306917 -4.236706 -0.297947
H  2.936336 -3.556231 -0.106053
H  2.559004 -2.84368 -2.381874
H  0.798649 -2.77547 -2.146758
H  0.134639 0.004911 -2.18325
H  -3.049819 -0.288743 1.561377
H  -2.136433 0.843516 -2.471981
H  0.672595 2.126082 1.708302
H  2.606172 3.485061 -1.770794
H  0.996523 4.127209 0.124874
elementType: Cl O N C H
totalener: -1699.53312077 hartree
nucrepener: 1778.80354719 hartree
electener: -3478.33666796 hartree
oneelecener: -5847.16969208 hartree
twoeener: 2368.83302412 hartree
cpcmener: -0.10452494 hartree
kineticenergy: 1694.92912173 hartree
xcener: -116.365439875093 hartree
chargesum: 1.0000000
charge: -0.064705 -0.073383 -0.374029 -0.373847 0.124609 -0.282315 -0.085849 0.599826 -0.125166 -0.104723 0.046330 -0.012855 -0.061362 -0.131382 -0.116954 -0.174105 0.191011 0.103913 0.153942 0.139475 0.145343 0.094737 0.087735 0.114897 0.096845 0.150354 0.123542 0.147267 0.216013 0.199770 0.245068
qa: -0.0647 -0.0734 -0.3740 -0.3738 0.1246 -0.2823 -0.0858 0.5998 -0.1252 -0.1047 0.0463 -0.0129 -0.0614 -0.1314 -0.1170 -0.1741 0.1910 0.1039 0.1539 0.1395 0.1453 0.0947 0.0877 0.1149 0.0968 0.1504 0.1235 0.1473 0.2160 0.1998 0.2451
va: 1.2554 1.2299 2.0027 2.0003 3.4519 2.9100 3.5600 3.8373 3.8676 3.5815 3.9453 3.9656 4.0469 3.8618 4.0528 4.0565 3.9079 3.8861 3.9440 1.0211 1.0139 0.9959 0.9957 0.9970 0.9944 1.0240 1.0233 1.0054 0.9710 0.9782 0.9666
dispersion: -0.017623024 hartree
energy: -1699.550743797604 hartree
dipole: 17.93833 -15.06442 2.87391 -2.11188 6.20716 4.09528 -7.45156 7.35248 -0.09909
magnitude: 5.00404 au
magnitude: 12.71927 debye
