program: Orca
programVersion: 5.0.2
elementType: Cl Cl O O N N N C C C C C C C C C C C C H H H H H H H H H H H H
charge: 1
multiplicity: 1
keywords: wb97x-d3
keywords: def2-TZVPP
keywords: def2/J RIJCOSX
keywords: DEFGRID2
keywords: scfconv7
keywords: smallprint printgap noloewdin
keywords: NOSOSCF
formula: C12H12Cl2N3O2
InChI: InChI=1/C12H12Cl2N3O2/c13-9-1-2-10(11(14)5-9)12(18-3-4-19-12)6-17-8-15-7-16-17/h1-2,5,7-8,15H,3-4,6H2
31 atoms
Cl 0.259289 -1.092857 1.742677
Cl -4.704166 -0.464378 -0.046887
O  1.141661 2.554308 -0.810137
O  1.751598 1.235497 0.904283
N  2.054401 -0.957731 -0.959317
N  1.200185 -1.92295 -1.343025
N  2.730804 -2.719806 -0.016361
C  1.095782 1.24213 -0.331881
C  1.882456 0.419049 -1.364803
C  -0.351747 0.76559 -0.194521
C  1.221957 3.399635 0.330263
C  2.076799 2.575704 1.268647
C  -0.798538 -0.227055 0.676431
C  -1.303932 1.345228 -1.031809
C  -2.13358 -0.605213 0.729463
C  -2.638345 0.984294 -1.002692
C  2.975748 -1.424763 -0.148283
C  -3.043837 0.007936 -0.110566
C  1.627688 -2.992892 -0.754565
H  2.872404 0.855177 -1.492999
H  1.373337 0.418823 -2.326454
H  0.228274 3.59782 0.743455
H  1.679797 4.341586 0.034914
H  3.143705 2.757265 1.117575
H  1.834484 2.734425 2.318904
H  -1.000328 2.109455 -1.732967
H  -2.452363 -1.373396 1.419945
H  -3.344071 1.462927 -1.666745
H  3.786434 -0.874973 0.300047
H  1.189343 -3.972715 -0.839756
H  3.273916 -3.369676 0.540184
elementType: Cl O N C H
totalener: -1699.52958897 hartree
nucrepener: 1793.20896629 hartree
electener: -3492.73855526 hartree
oneelecener: -5876.66473216 hartree
twoeener: 2383.92617690 hartree
cpcmener: -0.11168500 hartree
kineticenergy: 1694.92867782 hartree
xcener: -116.367261008013 hartree
chargesum: 1.0000000
charge: -0.075395 -0.080281 -0.389386 -0.386694 0.099346 -0.293492 -0.082194 0.604910 -0.066714 -0.047419 0.000227 0.038353 -0.077299 -0.167621 -0.095859 -0.165268 0.183581 0.088002 0.145551 0.142815 0.146406 0.096402 0.115878 0.089765 0.097045 0.144874 0.121637 0.148089 0.216000 0.198567 0.250174
qa: -0.0754 -0.0803 -0.3894 -0.3867 0.0993 -0.2935 -0.0822 0.6049 -0.0667 -0.0474 0.0002 0.0384 -0.0773 -0.1676 -0.0959 -0.1653 0.1836 0.0880 0.1456 0.1428 0.1464 0.0964 0.1159 0.0898 0.0970 0.1449 0.1216 0.1481 0.2160 0.1986 0.2502
va: 1.2406 1.2230 1.9849 1.9830 3.4495 2.8746 3.5503 3.7865 3.8311 3.5867 3.9633 3.9387 3.9989 3.9773 4.0279 4.0162 3.9276 3.8842 3.9512 1.0097 1.0079 0.9971 0.9963 0.9971 0.9949 1.0240 1.0224 1.0049 0.9770 0.9803 0.9634
dispersion: -0.017768779 hartree
energy: -1699.547357745779 hartree
dipole: 18.06153 -12.26307 5.79846 10.21719 -12.17427 -1.95708 -3.89708 3.68299 -0.21409
magnitude: 6.12357 au
magnitude: 15.56489 debye
