program: Orca
programVersion: 5.0.2
elementType: Cl Cl O O N N N C C C C C C C C C C C C H H H H H H H H H H H H
charge: 1
multiplicity: 1
keywords: wb97x-d3
keywords: def2-TZVPP
keywords: def2/J RIJCOSX
keywords: DEFGRID2
keywords: scfconv7
keywords: smallprint printgap noloewdin
keywords: NOSOSCF
formula: C12H12Cl2N3O2
InChI: InChI=1/C12H12Cl2N3O2/c13-9-1-2-10(11(14)5-9)12(18-3-4-19-12)6-17-8-15-7-16-17/h1-2,5,7-8,15H,3-4,6H2
31 atoms
Cl -0.356514 0.227737 2.851587
Cl -4.543647 -0.835502 -0.259649
O  1.624663 1.552053 -0.990374
O  1.377724 1.949178 1.217203
N  2.054556 -1.178174 -0.587278
N  2.912897 -1.08732 -1.619878
N  1.456294 -2.671426 -1.956658
C  1.195285 0.988161 0.21726
C  2.091253 -0.233845 0.511244
C  -0.268079 0.574981 0.136879
C  1.911445 2.929952 -0.7707
C  2.250184 2.950216 0.700584
C  -1.018407 0.200678 1.251748
C  -0.886814 0.483564 -1.106628
C  -2.332504 -0.225814 1.139019
C  -2.196148 0.054557 -1.248451
C  1.164597 -2.126331 -0.784598
C  -2.91014 -0.293939 -0.11672
C  2.537091 -2.012477 -2.442339
H  1.772083 -0.755574 1.411103
H  3.126135 0.078424 0.644231
H  1.038711 3.548957 -0.999631
H  2.739034 3.224828 -1.41426
H  3.298345 2.692543 0.883514
H  2.025134 3.89634 1.190997
H  -0.33838 0.752171 -1.99786
H  -2.892847 -0.504054 2.020904
H  -2.643773 -0.005142 -2.230516
H  0.369115 -2.417757 -0.117533
H  3.005558 -2.242194 -3.38418
H  0.967371 -3.447193 -2.391029
elementType: Cl O N C H
totalener: -1699.53098970 hartree
nucrepener: 1769.67411478 hartree
electener: -3469.20510448 hartree
oneelecener: -5828.78389025 hartree
twoeener: 2359.57878578 hartree
cpcmener: -0.11765273 hartree
kineticenergy: 1694.90033105 hartree
xcener: -116.360525935927 hartree
chargesum: 1.0000000
charge: -0.068722 -0.079014 -0.411590 -0.379615 0.132536 -0.293525 -0.085723 0.631645 -0.128805 -0.152525 0.020883 0.024859 -0.022220 -0.094789 -0.140636 -0.173674 0.172131 0.118119 0.155785 0.147441 0.138505 0.088747 0.104730 0.088527 0.110188 0.151235 0.123750 0.147652 0.224770 0.200463 0.248872
qa: -0.0687 -0.0790 -0.4116 -0.3796 0.1325 -0.2935 -0.0857 0.6316 -0.1288 -0.1525 0.0209 0.0249 -0.0222 -0.0948 -0.1406 -0.1737 0.1721 0.1181 0.1558 0.1474 0.1385 0.0887 0.1047 0.0885 0.1102 0.1512 0.1237 0.1477 0.2248 0.2005 0.2489
va: 1.2534 1.2240 1.9712 1.9946 3.4472 2.9138 3.5604 3.7836 3.8831 3.6357 3.9622 3.9685 4.0214 3.8312 4.0805 4.0495 3.9218 3.8676 3.9443 1.0155 1.0113 0.9970 0.9972 0.9966 0.9950 1.0244 1.0241 1.0052 0.9629 0.9776 0.9639
dispersion: -0.017397037 hartree
energy: -1699.548386734558 hartree
dipole: 18.48643 -15.43432 3.05210 5.08626 -8.48123 -3.39497 -9.50474 6.57827 -2.92647
magnitude: 5.42268 au
magnitude: 13.78335 debye
