program: Orca
programVersion: 5.0.2
elementType: Cl Cl O O N N N C C C C C C C C C C C C H H H H H H H H H H H H
charge: 1
multiplicity: 1
keywords: wb97x-d3
keywords: def2-TZVPP
keywords: def2/J RIJCOSX
keywords: DEFGRID2
keywords: scfconv7
keywords: smallprint printgap noloewdin
keywords: NOSOSCF
formula: C12H12Cl2N3O2
InChI: InChI=1/C12H12Cl2N3O2/c13-9-1-2-10(11(14)5-9)12(18-3-4-19-12)6-17-8-15-7-16-17/h1-2,5,7-8,15H,3-4,6H2
31 atoms
Cl -1.086429 -0.788156 -2.112669
Cl -5.160544 0.958576 0.839494
O  1.280049 0.638678 -0.99073
O  1.484043 0.861256 1.214438
N  2.576816 -1.518964 0.159559
N  3.05065 -1.858744 -1.053021
N  4.679128 -1.481661 0.341041
C  0.797852 0.151349 0.222423
C  1.160722 -1.325682 0.380298
C  -0.711075 0.340567 0.353635
C  1.49084 2.028574 -0.793634
C  1.910418 2.109425 0.671556
C  -1.611535 -0.042692 -0.639975
C  -1.240137 0.907134 1.508558
C  -2.977989 0.143192 -0.499571
C  -2.60019 1.10632 1.674918
C  3.551857 -1.276615 1.006376
C  -3.459678 0.722101 0.66157
C  4.336992 -1.838212 -0.921173
H  0.630645 -1.960161 -0.324549
H  0.9116 -1.657856 1.386767
H  0.575297 2.594938 -0.987271
H  2.262744 2.364923 -1.483057
H  2.990906 2.191126 0.79674
H  1.43042 2.938186 1.193882
H  -0.577193 1.20553 2.30784
H  -3.653175 -0.160069 -1.28772
H  -2.976434 1.554721 2.583704
H  3.461308 -0.997128 2.042677
H  5.048842 -2.071577 -1.694185
H  5.615183 -1.399276 0.722343
elementType: Cl O N C H
totalener: -1699.53345485 hartree
nucrepener: 1744.33227445 hartree
electener: -3443.86572931 hartree
oneelecener: -5779.28715164 hartree
twoeener: 2335.42142234 hartree
cpcmener: -0.11647508 hartree
kineticenergy: 1694.93094823 hartree
xcener: -116.366720260390 hartree
chargesum: 1.0000000
charge: -0.072354 -0.079743 -0.374173 -0.411350 0.126454 -0.295193 -0.093217 0.604529 -0.103414 -0.117555 0.025069 0.005372 -0.019939 -0.127055 -0.153395 -0.191712 0.190997 0.120678 0.150405 0.151845 0.155885 0.096514 0.114189 0.104305 0.106179 0.151711 0.123411 0.146806 0.215492 0.201105 0.248157
qa: -0.0724 -0.0797 -0.3742 -0.4113 0.1265 -0.2952 -0.0932 0.6045 -0.1034 -0.1176 0.0251 0.0054 -0.0199 -0.1271 -0.1534 -0.1917 0.1910 0.1207 0.1504 0.1518 0.1559 0.0965 0.1142 0.1043 0.1062 0.1517 0.1234 0.1468 0.2155 0.2011 0.2482
va: 1.2487 1.2237 1.9835 1.9632 3.4574 2.9056 3.5654 3.8412 3.7523 3.5627 3.9155 3.9098 4.0071 3.9477 4.0833 4.0547 3.9196 3.8564 3.9523 1.0239 1.0057 1.0003 0.9978 0.9994 0.9999 1.0207 1.0253 1.0071 0.9776 0.9773 0.9643
dispersion: -0.016719715 hartree
energy: -1699.550174569424 hartree
dipole: 23.49559 -15.69820 7.79739 4.00092 -5.19652 -1.19559 6.65438 -4.51140 2.14298
magnitude: 8.17442 au
magnitude: 20.77773 debye
