program: Orca
programVersion: 5.0.2
elementType: Cl Cl O O O N N N C C C C C C C C C C C C C C C C C C C H H H H H H H H H H H H H H H H H H
charge: 1
multiplicity: 1
keywords: wb97x-d3
keywords: def2-TZVPP
keywords: def2/J RIJCOSX
keywords: DEFGRID2
keywords: scfconv7
keywords: smallprint printgap noloewdin
keywords: NOSOSCF
formula: C19H18Cl2N3O3
InChI: InChI=1/C19H18Cl2N3O3/c1-13-9-25-19(27-13,10-24-12-22-11-23-24)17-7-6-16(8-18(17)21)26-15-4-2-14(20)3-5-15/h2-8,11-13,23H,9-10H2,1H3
45 atoms
Cl 0.690968 -1.780942 -0.079485
Cl -7.052502 -2.587796 -0.045284
O  2.964198 -0.164036 -1.046558
O  3.236298 1.918017 -0.340553
O  -3.025905 1.651513 0.187386
N  4.489183 0.017987 1.288128
N  5.063291 -0.961661 0.581652
N  6.655594 0.14982 1.563292
C  2.558165 0.739831 -0.058642
C  3.190405 0.57788 -2.252898
C  3.052549 0.238794 1.300819
C  3.260189 2.034213 -1.75426
C  1.054019 0.926777 -0.002049
C  2.11039 0.334363 -3.282441
C  0.151487 -0.133707 -0.016899
C  0.520933 2.211241 0.112904
C  -1.218166 0.063547 0.041764
C  -0.836612 2.437324 0.172586
C  -1.717425 1.358765 0.129866
C  5.482017 0.675599 1.86935
C  6.37449 -0.855641 0.760255
C  -3.954775 0.635236 0.13003
C  -4.403737 0.056703 1.304609
C  -4.4516 0.234913 -1.098764
C  -5.364467 -0.939919 1.250004
C  -5.412991 -0.761136 -1.153749
C  -5.861226 -1.347391 0.020923
H  4.156874 0.25138 -2.646672
H  2.553737 -0.68674 1.587894
H  2.850407 0.984028 2.068232
H  4.177557 2.547038 -2.040694
H  2.408029 2.619185 -2.114726
H  2.049486 -0.718747 -3.551865
H  2.335364 0.894455 -4.191047
H  1.132473 0.655018 -2.923361
H  1.188118 3.061553 0.153846
H  -1.880067 -0.791222 0.020968
H  -1.22591 3.443041 0.252949
H  5.316959 1.524646 2.514552
H  7.087294 -1.521182 0.298273
H  -4.018438 0.389885 2.259299
H  -4.103552 0.706516 -2.008449
H  -5.727876 -1.394696 2.160656
H  -5.814938 -1.076328 -2.106401
H  4.507427 -1.52168 -0.056205
totalener: -2045.04190896 hartree
nucrepener: 2754.31434197 hartree
electener: -4799.35625093 hartree
oneelecener: -8255.05497828 hartree
twoeener: 3455.69872735 hartree
kineticenergy: 2039.08448242 hartree
xcener: -150.083044087688 hartree
chargesum: 1.0000000
charge: -0.053748 -0.045329 -0.395587 -0.346340 -0.276548 0.096262 -0.047253 -0.277160 0.616767 0.171623 -0.182806 -0.059054 -0.247775 -0.275356 -0.047994 -0.080058 -0.131811 -0.223072 0.271030 0.168639 0.173511 0.193926 -0.158223 -0.155872 -0.113078 -0.113019 0.071420 0.084373 0.183668 0.128970 0.115332 0.110911 0.100370 0.108813 0.089167 0.150461 0.128530 0.142949 0.173079 0.193514 0.133659 0.134269 0.132467 0.132824 0.223546
qa: -0.0537 -0.0453 -0.3956 -0.3463 -0.2765 0.0963 -0.0473 -0.2772 0.6168 0.1716 -0.1828 -0.0591 -0.2478 -0.2754 -0.0480 -0.0801 -0.1318 -0.2231 0.2710 0.1686 0.1735 0.1939 -0.1582 -0.1559 -0.1131 -0.1130 0.0714 0.0844 0.1837 0.1290 0.1153 0.1109 0.1004 0.1088 0.0892 0.1505 0.1285 0.1429 0.1731 0.1935 0.1337 0.1343 0.1325 0.1328 0.2235
va: 1.2780 1.2588 1.9315 2.0106 2.1479 3.3942 3.4784 3.0678 3.8243 3.8198 3.7354 3.9410 3.5271 3.9992 4.0946 3.9152 3.9318 4.0977 3.8988 4.0101 3.9578 3.8150 4.0183 4.0188 3.9805 3.9802 3.9820 1.0026 1.0078 1.0138 1.0033 0.9981 1.0105 1.0079 0.9974 1.0138 1.0290 1.0136 0.9886 0.9770 1.0062 1.0058 1.0092 1.0089 1.0074
dispersion: -0.025530430 hartree
energy: -2045.067439390836 hartree
dipole: 24.48562 -18.28435 6.20127 14.70164 -14.46997 0.23167 -8.94567 9.28099 0.33532
magnitude: 6.21465 au
magnitude: 15.79637 debye
