program: Orca
programVersion: 5.0.2
elementType: Cl Cl O O O N N N C C C C C C C C C C C C C C C C C C C H H H H H H H H H H H H H H H H H H
charge: 1
multiplicity: 1
keywords: wb97x-d3
keywords: def2-TZVPP
keywords: def2/J RIJCOSX
keywords: DEFGRID2
keywords: scfconv7
keywords: smallprint printgap noloewdin
keywords: NOSOSCF
formula: C19H18Cl2N3O3
InChI: InChI=1/C19H18Cl2N3O3/c1-13-9-25-19(27-13,10-24-12-22-11-23-24)17-7-6-16(8-18(17)21)26-15-4-2-14(20)3-5-15/h2-8,11-13,23H,9-10H2,1H3
45 atoms
Cl 2.484622 -2.31331 -1.882655
Cl -6.672777 1.127195 2.14867
O  3.651582 0.447415 -2.055517
O  3.0445 1.953692 -0.540881
O  -2.256962 -1.500672 -0.650748
N  3.302249 -0.030086 1.517144
N  3.086914 1.134962 2.138418
N  2.235694 -0.432134 3.3849
C  3.021586 0.581513 -0.839764
C  3.357114 1.604095 -2.839708
C  3.912776 -0.115561 0.201766
C  2.960793 2.653252 -1.780612
C  1.600119 0.035278 -0.803368
C  2.280446 1.340853 -3.870937
C  1.276409 -1.249995 -1.248195
C  0.558385 0.79798 -0.28441
C  -0.012753 -1.739581 -1.186644
C  -0.743499 0.333119 -0.209445
C  -1.033585 -0.948005 -0.665477
C  2.769236 -0.960192 2.296638
C  2.435053 0.863482 3.262812
C  -3.279514 -0.859808 0.014478
C  -4.207716 -0.133845 -0.710611
C  -3.387181 -0.984543 1.389828
C  -5.261452 0.478677 -0.050416
C  -4.437844 -0.369488 2.050306
C  -5.368075 0.363251 1.32728
H  4.287589 1.880541 -3.338884
H  4.902415 0.342835 0.232162
H  4.026928 -1.172668 -0.028076
H  3.643514 3.501592 -1.741264
H  1.945567 3.026871 -1.942032
H  2.126544 2.231624 -4.481388
H  1.327274 1.080023 -3.410412
H  2.571489 0.531546 -4.538454
H  0.754632 1.804039 0.060889
H  -0.238643 -2.735676 -1.543143
H  -1.517953 0.972325 0.191155
H  2.789817 -2.009058 2.042733
H  2.129688 1.625512 3.963191
H  -4.120901 -0.058874 -1.786521
H  -2.667635 -1.573197 1.944262
H  -5.998078 1.040689 -0.607122
H  -4.538726 -0.467818 3.122117
H  3.305523 2.010238 1.672429
totalener: -2045.03853147 hartree
nucrepener: 2808.22613966 hartree
electener: -4853.26467112 hartree
oneelecener: -8362.12628137 hartree
twoeener: 3508.86161025 hartree
kineticenergy: 2039.07766329 hartree
xcener: -150.082141154920 hartree
chargesum: 1.0000000
charge: -0.024776 -0.042925 -0.315757 -0.415002 -0.278082 0.079529 -0.049203 -0.271269 0.621307 0.198830 -0.161810 -0.090564 -0.273833 -0.292603 -0.003547 -0.128015 -0.165494 -0.187540 0.254959 0.173341 0.176052 0.203915 -0.165167 -0.160642 -0.107994 -0.117094 0.067841 0.101282 0.152761 0.143893 0.115381 0.109939 0.106051 0.085894 0.109358 0.139349 0.135694 0.143215 0.178968 0.190989 0.137103 0.131935 0.135232 0.132303 0.226194
qa: -0.0248 -0.0429 -0.3158 -0.4150 -0.2781 0.0795 -0.0492 -0.2713 0.6213 0.1988 -0.1618 -0.0906 -0.2738 -0.2926 -0.0035 -0.1280 -0.1655 -0.1875 0.2550 0.1733 0.1761 0.2039 -0.1652 -0.1606 -0.1080 -0.1171 0.0678 0.1013 0.1528 0.1439 0.1154 0.1099 0.1061 0.0859 0.1094 0.1393 0.1357 0.1432 0.1790 0.1910 0.1371 0.1319 0.1352 0.1323 0.2262
va: 1.3080 1.2614 2.0563 1.9187 2.1412 3.3891 3.4695 3.0623 3.7940 3.8125 3.8027 3.9658 3.4409 3.9888 4.0938 3.8781 4.0751 4.0508 3.9188 3.9877 3.9642 3.7993 4.0227 4.0114 3.9698 3.9809 3.9862 0.9958 1.0182 1.0267 1.0049 0.9932 1.0104 0.9925 1.0094 1.0204 1.0241 1.0098 0.9872 0.9782 1.0070 1.0050 1.0078 1.0095 1.0099
dispersion: -0.026747114 hartree
energy: -2045.065278580748 hartree
dipole: 19.01227 -14.65192 4.36036 12.39818 -10.63515 1.76303 -9.86961 11.14378 1.27418
magnitude: 4.87284 au
magnitude: 12.38576 debye
