program: Orca
programVersion: 5.0.2
elementType: Cl Cl O O O N N N C C C C C C C C C C C C C C C C C C C H H H H H H H H H H H H H H H H H H
charge: 1
multiplicity: 1
keywords: wb97x-d3
keywords: def2-TZVPP
keywords: def2/J RIJCOSX
keywords: DEFGRID2
keywords: scfconv7
keywords: smallprint printgap noloewdin
keywords: NOSOSCF
formula: C19H18Cl2N3O3
InChI: InChI=1/C19H18Cl2N3O3/c1-13-9-25-19(27-13,10-24-12-22-11-23-24)17-7-6-16(8-18(17)21)26-15-4-2-14(20)3-5-15/h2-8,11-13,23H,9-10H2,1H3
45 atoms
Cl 0.394242 0.799557 1.898156
Cl -7.62658 0.626696 1.27392
O  3.277948 -0.027528 -1.481491
O  2.682815 1.424304 0.102364
O  -2.810369 -1.553757 -1.242511
N  4.601941 -0.487306 0.899315
N  5.050312 0.580616 1.564853
N  6.764491 -0.361765 0.624272
C  2.548245 0.096322 -0.298303
C  3.484846 1.270081 -2.056944
C  3.197386 -0.810345 0.753152
C  2.744349 2.188142 -1.0896
C  1.092989 -0.311596 -0.50414
C  2.982109 1.336404 -3.477999
C  0.079091 -0.0365 0.410737
C  0.731472 -1.028624 -1.643202
C  -1.235031 -0.42656 0.19976
C  -0.569717 -1.422372 -1.884979
C  -1.559544 -1.112978 -0.962046
C  5.664547 -1.034334 0.330962
C  6.357078 0.632917 1.393692
C  -3.903683 -1.00646 -0.62249
C  -4.775456 -1.865344 0.025397
C  -4.17025 0.35356 -0.695125
C  -5.930725 -1.364384 0.605847
C  -5.31649 0.857458 -0.103008
C  -6.189801 -0.005309 0.54223
H  4.559861 1.472794 -2.033541
H  3.144564 -1.850065 0.435986
H  2.714643 -0.728972 1.725922
H  3.275681 3.116196 -0.884441
H  1.738726 2.432173 -1.451121
H  3.498133 0.620017 -4.11744
H  3.169778 2.331255 -3.885401
H  1.90951 1.146926 -3.536489
H  1.486952 -1.282841 -2.372764
H  -1.985164 -0.197441 0.944702
H  -0.817124 -1.96875 -2.785845
H  5.594902 -1.919903 -0.280617
H  6.971122 1.400336 1.837441
H  -4.561078 -2.925029 0.071891
H  -3.496213 1.025099 -1.211828
H  -6.61478 -2.035252 1.107227
H  -5.525875 1.916953 -0.155571
H  4.431947 1.1870 2.094832
elementType: Cl O N C H
totalener: -2045.13965454 hartree
nucrepener: 2734.84566132 hartree
electener: -4779.98531586 hartree
oneelecener: -8215.76821432 hartree
twoeener: 3435.78289846 hartree
cpcmener: -0.10302561 hartree
kineticenergy: 2039.03735679 hartree
xcener: -150.074682027997 hartree
chargesum: 1.0000000
charge: -0.076202 -0.093171 -0.401852 -0.373235 -0.313765 0.104024 -0.031332 -0.357606 0.570655 0.135893 -0.090845 0.019548 -0.130068 -0.283325 0.000568 -0.133698 -0.179127 -0.266282 0.301818 0.156931 0.191002 0.276327 -0.235461 -0.202048 -0.110253 -0.121479 0.067629 0.084788 0.142823 0.165721 0.116438 0.092620 0.098269 0.105101 0.086005 0.154518 0.131298 0.148169 0.195858 0.205450 0.149633 0.161231 0.145600 0.146005 0.245828
qa: -0.0762 -0.0932 -0.4019 -0.3732 -0.3138 0.1040 -0.0313 -0.3576 0.5707 0.1359 -0.0908 0.0195 -0.1301 -0.2833 0.0006 -0.1337 -0.1791 -0.2663 0.3018 0.1569 0.1910 0.2763 -0.2355 -0.2020 -0.1103 -0.1215 0.0676 0.0848 0.1428 0.1657 0.1164 0.0926 0.0983 0.1051 0.0860 0.1545 0.1313 0.1482 0.1959 0.2054 0.1496 0.1612 0.1456 0.1460 0.2458
va: 1.2476 1.2095 1.9755 1.9820 2.1020 3.3954 3.5139 3.0422 3.9132 3.9134 3.7310 3.9054 3.5559 3.9679 4.0161 3.9287 3.9735 4.0737 3.7906 4.0054 3.9459 3.6995 4.0475 3.9792 3.9486 3.9543 3.8572 1.0017 1.0066 1.0099 0.9982 1.0064 1.0042 1.0057 1.0020 1.0174 1.0253 1.0092 0.9830 0.9723 1.0047 0.9930 1.0024 1.0032 0.9770
dispersion: -0.025200171 hartree
energy: -2045.164854710672 hartree
dipole: 28.61367 -20.71221 7.90146 1.46000 -0.93238 0.52761 -17.53519 18.47460 0.93941
magnitude: 7.97458 au
magnitude: 20.26978 debye
