program: Orca
programVersion: 5.0.2
elementType: Cl Cl O O O N N N C C C C C C C C C C C C C C C C C C C H H H H H H H H H H H H H H H H H H
charge: 1
multiplicity: 1
keywords: wb97x-d3
keywords: def2-TZVPP
keywords: def2/J RIJCOSX
keywords: DEFGRID2
keywords: scfconv7
keywords: smallprint printgap noloewdin
keywords: NOSOSCF
formula: C19H18Cl2N3O3
InChI: InChI=1/C19H18Cl2N3O3/c1-13-9-25-19(27-13,10-24-12-22-11-23-24)17-7-6-16(8-18(17)21)26-15-4-2-14(20)3-5-15/h2-8,11-13,23H,9-10H2,1H3
45 atoms
Cl 1.659078 0.242668 3.026422
Cl -7.493631 -1.410112 -2.008791
O  2.61555 0.572976 -1.379209
O  3.171112 1.249407 0.670552
O  -3.042277 0.248437 1.414811
N  4.520458 -1.040987 -0.029878
N  5.048395 -0.990326 -1.256209
N  6.681192 -0.784821 0.161266
C  2.45773 0.275743 -0.020189
C  3.007789 1.94593 -1.524376
C  3.096926 -1.093197 0.231517
C  3.026287 2.442131 -0.081149
C  0.984709 0.248655 0.370005
C  2.06593 2.700038 -2.430596
C  0.546593 0.248362 1.695376
C  0.002452 0.215936 -0.614187
C  -0.797075 0.232029 2.021151
C  -1.350269 0.206419 -0.318724
C  -1.749385 0.21774 1.009986
C  5.534868 -0.903266 0.809426
C  6.352188 -0.839145 -1.118022
C  -4.044835 -0.148102 0.566221
C  -5.059392 0.753476 0.291612
C  -4.080533 -1.43661 0.0520
C  -6.129539 0.363772 -0.499844
C  -5.142614 -1.823759 -0.748546
C  -6.160944 -0.920962 -1.017252
H  4.017016 1.956465 -1.947957
H  2.643153 -1.847981 -0.410807
H  2.982569 -1.41686 1.263509
H  3.867328 3.098087 0.137794
H  2.097787 2.963016 0.180488
H  1.049574 2.713608 -2.03493
H  2.044518 2.267704 -3.43127
H  2.402453 3.733338 -2.529216
H  0.295095 0.205474 -1.65448
H  -1.112294 0.235195 3.05647
H  -2.069723 0.200398 -1.126572
H  5.397663 -0.904367 1.879514
H  7.023156 -0.775789 -1.959812
H  -5.023903 1.755142 0.700483
H  -3.291737 -2.144161 0.274814
H  -6.925975 1.064355 -0.710956
H  -5.174402 -2.827524 -1.150129
H  4.477619 -1.051301 -2.094626
elementType: Cl O N C H
totalener: -2045.13968042 hartree
nucrepener: 2723.90956420 hartree
electener: -4769.04924462 hartree
oneelecener: -8193.84759196 hartree
twoeener: 3424.79834734 hartree
cpcmener: -0.10392091 hartree
kineticenergy: 2039.02662795 hartree
xcener: -150.072440253277 hartree
chargesum: 1.0000000
charge: -0.075044 -0.092890 -0.413054 -0.363505 -0.316500 0.101869 -0.032401 -0.357283 0.568416 0.143608 -0.097814 0.018836 -0.135815 -0.286239 0.030907 -0.163649 -0.231732 -0.205652 0.287532 0.168414 0.191811 0.267233 -0.227719 -0.193079 -0.113053 -0.125993 0.071520 0.083307 0.164879 0.146069 0.118009 0.093463 0.087539 0.097399 0.105555 0.155642 0.128045 0.155263 0.194405 0.204824 0.149477 0.160184 0.145864 0.144950 0.246399
qa: -0.0750 -0.0929 -0.4131 -0.3635 -0.3165 0.1019 -0.0324 -0.3573 0.5684 0.1436 -0.0978 0.0188 -0.1358 -0.2862 0.0309 -0.1636 -0.2317 -0.2057 0.2875 0.1684 0.1918 0.2672 -0.2277 -0.1931 -0.1131 -0.1260 0.0715 0.0833 0.1649 0.1461 0.1180 0.0935 0.0875 0.0974 0.1056 0.1556 0.1280 0.1553 0.1944 0.2048 0.1495 0.1602 0.1459 0.1449 0.2464
va: 1.2466 1.2099 1.9628 1.9828 2.0963 3.3842 3.5091 3.0426 3.9030 3.8940 3.7238 3.9129 3.5488 3.9714 3.9884 3.9692 4.1213 3.9734 3.8105 4.0011 3.9446 3.7067 4.0417 3.9821 3.9499 3.9601 3.8543 1.0066 1.0009 1.0192 0.9984 1.0045 1.0012 1.0042 1.0056 1.0174 1.0277 1.0010 0.9835 0.9727 1.0044 0.9939 1.0023 1.0037 0.9775
dispersion: -0.025135014 hartree
energy: -2045.164815431594 hartree
dipole: 22.09782 -14.71747 7.38035 10.45207 -11.22888 -0.77681 -12.34656 9.99572 -2.35084
magnitude: 7.78456 au
magnitude: 19.78678 debye
