program: Orca
programVersion: 5.0.2
elementType: Cl Cl O O O N N N C C C C C C C C C C C C C C C C C C C H H H H H H H H H H H H H H H H H H
charge: 1
multiplicity: 1
keywords: wb97x-d3
keywords: def2-TZVPP
keywords: def2/J RIJCOSX
keywords: DEFGRID2
keywords: scfconv7
keywords: smallprint printgap noloewdin
keywords: NOSOSCF
formula: C19H18Cl2N3O3
InChI: InChI=1/C19H18Cl2N3O3/c1-13-9-25-19(27-13,10-24-12-22-11-23-24)17-7-6-16(8-18(17)21)26-15-4-2-14(20)3-5-15/h2-8,11-13,23H,9-10H2,1H3
45 atoms
Cl 1.863928 2.689468 2.038054
Cl -6.928297 -2.072385 -1.324542
O  2.932925 0.512518 -1.78338
O  3.055019 2.459785 -0.66471
O  -2.36658 0.109714 1.627519
N  3.642163 -0.945128 0.578929
N  3.787632 -1.854703 -0.389605
N  3.038062 -2.892831 1.365456
C  2.798902 1.099948 -0.519094
C  3.158964 1.534127 -2.763734
C  3.876869 0.474088 0.394914
C  3.720381 2.65409 -1.905125
C  1.405464 0.868067 0.044364
C  1.885163 1.895735 -3.496196
C  0.916032 1.521361 1.175971
C  0.571579 -0.078972 -0.543313
C  -0.35091 1.272816 1.672973
C  -0.693845 -0.360887 -0.057539
C  -1.15794 0.328759 1.053067
C  3.179733 -1.604993 1.630485
C  3.421562 -3.021907 0.107052
C  -3.401833 -0.403885 0.890282
C  -4.063784 -1.512104 1.39215
C  -3.821563 0.201329 -0.286409
C  -5.15938 -2.024596 0.713997
C  -4.90799 -0.317391 -0.971551
C  -5.56872 -1.427694 -0.467212
H  3.903369 1.151544 -3.463805
H  3.865397 0.915289 1.389274
H  4.87205 0.613688 -0.029859
H  4.806382 2.578135 -1.788711
H  3.477988 3.650533 -2.273939
H  2.109724 2.60896 -4.290474
H  1.14512 2.351808 -2.836172
H  1.436905 1.017611 -3.961852
H  0.912477 -0.624507 -1.411625
H  -0.714893 1.804284 2.542691
H  -1.294709 -1.115243 -0.547608
H  2.963929 -1.110851 2.565191
H  3.447865 -3.932483 -0.469776
H  -3.733173 -1.97318 2.313995
H  -3.314574 1.076843 -0.672617
H  -5.679862 -2.887244 1.107408
H  -5.23766 0.151965 -1.88849
H  4.122247 -1.607318 -1.31647
elementType: Cl O N C H
totalener: -2045.13663290 hartree
nucrepener: 2776.79188280 hartree
electener: -4821.92851570 hartree
oneelecener: -8299.20425753 hartree
twoeener: 3477.27574183 hartree
cpcmener: -0.10584775 hartree
kineticenergy: 2039.01179174 hartree
xcener: -150.069204050552 hartree
chargesum: 1.0000000
charge: -0.071128 -0.093708 -0.422932 -0.359897 -0.318317 0.086961 -0.018416 -0.350871 0.568521 0.173835 -0.129935 0.010537 -0.107339 -0.301959 -0.011090 -0.112649 -0.209390 -0.207636 0.282444 0.173578 0.191998 0.273893 -0.236736 -0.195582 -0.109401 -0.124037 0.065961 0.089893 0.135722 0.154767 0.092376 0.105173 0.104608 0.096329 0.092930 0.147606 0.129488 0.157343 0.193147 0.204426 0.149276 0.161708 0.146414 0.146434 0.245657
qa: -0.0711 -0.0937 -0.4229 -0.3599 -0.3183 0.0870 -0.0184 -0.3509 0.5685 0.1738 -0.1299 0.0105 -0.1073 -0.3020 -0.0111 -0.1126 -0.2094 -0.2076 0.2824 0.1736 0.1920 0.2739 -0.2367 -0.1956 -0.1094 -0.1240 0.0660 0.0899 0.1357 0.1548 0.0924 0.1052 0.1046 0.0963 0.0929 0.1476 0.1295 0.1573 0.1931 0.2044 0.1493 0.1617 0.1464 0.1464 0.2457
va: 1.2515 1.2090 1.9557 2.0129 2.0940 3.3834 3.4958 3.0413 3.8810 3.9107 3.8907 3.9928 3.5127 3.9518 4.0292 3.8439 4.1147 3.9969 3.8103 3.9862 3.9494 3.7026 4.0451 3.9744 3.9488 3.9584 3.8581 1.0003 1.0195 0.9965 0.9975 0.9926 1.0079 1.0004 1.0076 1.0258 1.0262 0.9988 0.9820 0.9730 1.0049 0.9935 1.0021 1.0033 0.9812
dispersion: -0.025908475 hartree
energy: -2045.162541374608 hartree
dipole: 23.22450 -15.82785 7.39664 3.23988 -4.80805 -1.56817 -14.90894 13.27350 -1.63544
magnitude: 7.73590 au
magnitude: 19.66310 debye
