program: Orca
programVersion: 5.0.2
elementType: Cl Cl O O O N N N C C C C C C C C C C C C C C C C C C C H H H H H H H H H H H H H H H H H H
charge: 1
multiplicity: 1
keywords: wb97x-d3
keywords: def2-TZVPP
keywords: def2/J RIJCOSX
keywords: DEFGRID2
keywords: scfconv7
keywords: smallprint printgap noloewdin
keywords: NOSOSCF
formula: C19H18Cl2N3O3
InChI: InChI=1/C19H18Cl2N3O3/c1-13-9-25-19(27-13,10-24-12-22-11-23-24)17-7-6-16(8-18(17)21)26-15-4-2-14(20)3-5-15/h2-8,11-13,23H,9-10H2,1H3
45 atoms
Cl 0.76343 -1.737259 -1.690934
Cl -6.768882 -2.455426 0.952295
O  3.071711 0.038632 -2.295608
O  3.667851 1.619948 -0.809964
O  -2.459224 1.486209 0.529999
N  3.36604 -0.28246 1.347972
N  3.928513 0.774594 1.944397
N  2.660228 -0.201795 3.41396
C  2.923519 0.444731 -0.970728
C  4.005011 0.903695 -2.95488
C  3.558066 -0.61634 -0.05065
C  3.917654 2.15342 -2.10336
C  1.459383 0.680364 -0.620462
C  3.614985 1.083179 -4.399019
C  0.44268 -0.233601 -0.88828
C  1.093817 1.84275 0.056203
C  -0.875404 -0.004753 -0.523044
C  -0.207978 2.091461 0.444958
C  -1.197844 1.163637 0.153565
C  2.597484 -0.851939 2.263884
C  3.486533 0.804856 3.188344
C  -3.433817 0.525164 0.617018
C  -3.292605 -0.569099 1.458926
C  -4.595654 0.712567 -0.112788
C  -4.320989 -1.491687 1.559509
C  -5.631713 -0.202345 -0.002541
C  -5.482792 -1.302247 0.826043
H  5.010262 0.47075 -2.889239
H  4.626818 -0.704137 -0.250277
H  3.101066 -1.593038 -0.19375
H  4.843131 2.7267 -2.072998
H  3.100021 2.809482 -2.423633
H  3.642899 0.13567 -4.937407
H  4.320181 1.756993 -4.88706
H  2.615155 1.508821 -4.493734
H  1.84519 2.582809 0.292709
H  -1.63234 -0.736103 -0.772654
H  -0.455567 3.005005 0.969908
H  2.018378 -1.738302 2.053996
H  3.787211 1.564519 3.892238
H  -2.390094 -0.708448 2.041002
H  -4.69955 1.573023 -0.761494
H  -4.212711 -2.346589 2.213202
H  -6.541654 -0.054623 -0.568266
H  4.554129 1.400501 1.445329
elementType: Cl O N C H
totalener: -2045.13788708 hartree
nucrepener: 2779.82496716 hartree
electener: -4824.96285424 hartree
oneelecener: -8305.33796174 hartree
twoeener: 3480.37510750 hartree
cpcmener: -0.10482349 hartree
kineticenergy: 2039.00649127 hartree
xcener: -150.067857026276 hartree
chargesum: 1.0000000
charge: -0.069928 -0.092942 -0.373056 -0.406659 -0.313708 0.083178 -0.022262 -0.351235 0.577533 0.149782 -0.123415 0.008000 -0.129214 -0.271464 -0.053195 -0.072263 -0.150456 -0.273685 0.309756 0.180713 0.193532 0.270340 -0.199978 -0.229250 -0.123243 -0.111538 0.069271 0.074417 0.156580 0.136160 0.113269 0.091328 0.099709 0.095183 0.083036 0.150420 0.131546 0.147840 0.193145 0.203832 0.159845 0.149665 0.146821 0.146515 0.246072
qa: -0.0699 -0.0929 -0.3731 -0.4067 -0.3137 0.0832 -0.0223 -0.3512 0.5775 0.1498 -0.1234 0.0080 -0.1292 -0.2715 -0.0532 -0.0723 -0.1505 -0.2737 0.3098 0.1807 0.1935 0.2703 -0.2000 -0.2292 -0.1232 -0.1115 0.0693 0.0744 0.1566 0.1362 0.1133 0.0913 0.0997 0.0952 0.0830 0.1504 0.1315 0.1478 0.1931 0.2038 0.1598 0.1497 0.1468 0.1465 0.2461
va: 1.2560 1.2096 2.0206 1.9518 2.1022 3.3875 3.4921 3.0400 3.8413 3.9273 3.8707 3.9477 3.6066 3.9581 4.0882 3.8060 3.9542 4.0896 3.7852 3.9781 3.9507 3.7035 3.9796 4.0463 3.9568 3.9487 3.8575 1.0012 1.0004 1.0178 0.9991 1.0008 1.0029 1.0053 1.0094 1.0197 1.0260 1.0090 0.9823 0.9734 0.9943 1.0044 1.0031 1.0021 0.9828
dispersion: -0.025529256 hartree
energy: -2045.163416339895 hartree
dipole: 30.41639 -22.71762 7.69877 16.49723 -14.66000 1.83723 -9.31442 10.77989 1.46547
magnitude: 8.04948 au
magnitude: 20.46014 debye
