program: Orca
programVersion: 5.0.2
elementType: Cl Cl O O O N N N C C C C C C C C C C C C C C C C C C C H H H H H H H H H H H H H H H H H H
charge: 1
multiplicity: 1
keywords: wb97x-d3
keywords: def2-TZVPP
keywords: def2/J RIJCOSX
keywords: DEFGRID2
keywords: scfconv7
keywords: smallprint printgap noloewdin
keywords: NOSOSCF
formula: C19H18Cl2N3O3
InChI: InChI=1/C19H18Cl2N3O3/c1-13-9-25-19(27-13,10-24-12-22-11-23-24)17-7-6-16(8-18(17)21)26-15-4-2-14(20)3-5-15/h2-8,11-13,23H,9-10H2,1H3
45 atoms
Cl 1.886768 -2.38418 -1.470057
Cl -7.716554 1.562363 0.448924
O  3.13567 0.266509 -1.06727
O  2.496708 1.588399 0.600088
O  -2.872821 -1.663716 -0.218123
N  4.605661 -0.108266 1.286756
N  5.574174 -0.413099 0.417759
N  6.38726 1.046063 1.813134
C  2.465673 0.266563 0.155433
C  2.96523 1.545085 -1.68599
C  3.241898 -0.58072 1.164914
C  2.398348 2.412664 -0.552611
C  1.037863 -0.257744 0.038795
C  2.064969 1.470567 -2.898536
C  0.696048 -1.41089 -0.668074
C  0.003812 0.412792 0.684693
C  -0.612789 -1.850592 -0.75835
C  -1.313475 -0.007776 0.61881
C  -1.619257 -1.143235 -0.116387
C  5.123375 0.790743 2.10939
C  6.638903 0.285762 0.758582
C  -3.972303 -0.856216 -0.046576
C  -4.926203 -1.252042 0.876523
C  -4.160278 0.280089 -0.821171
C  -6.087371 -0.509026 1.026504
C  -5.315021 1.029582 -0.66488
C  -6.269995 0.628836 0.257958
H  3.958381 1.888258 -1.984278
H  3.263281 -1.632196 0.884369
H  2.786593 -0.506382 2.151516
H  2.978319 3.317903 -0.379218
H  1.357721 2.695082 -0.742571
H  2.468612 0.792854 -3.650845
H  1.985156 2.458489 -3.354065
H  1.058947 1.1402 -2.635367
H  0.226063 1.296455 1.266233
H  -0.856411 -2.742602 -1.320474
H  -2.076988 0.548523 1.145593
H  4.557655 1.224121 2.91875
H  7.572086 0.214714 0.224132
H  -4.771931 -2.141377 1.47354
H  -3.419255 0.582866 -1.550295
H  -6.835908 -0.8186 1.743139
H  -5.466752 1.913767 -1.268814
H  5.431676 -1.086432 -0.330995
elementType: Cl O N C H
totalener: -2045.13350359 hartree
nucrepener: 2732.24638108 hartree
electener: -4777.37988467 hartree
oneelecener: -8210.53354886 hartree
twoeener: 3433.15366419 hartree
cpcmener: -0.11574209 hartree
kineticenergy: 2038.99572046 hartree
xcener: -150.066735681721 hartree
chargesum: 1.0000000
charge: -0.078336 -0.098225 -0.393689 -0.401977 -0.328573 0.103240 -0.032696 -0.368168 0.616716 0.211185 -0.091872 -0.031813 -0.182530 -0.306866 0.022018 -0.122829 -0.220913 -0.217794 0.283489 0.158740 0.194329 0.275622 -0.239578 -0.191882 -0.112447 -0.128769 0.071008 0.091174 0.167179 0.149032 0.113284 0.103581 0.092421 0.106883 0.087229 0.151415 0.127608 0.156993 0.197699 0.205146 0.151846 0.164188 0.146468 0.147708 0.252753
qa: -0.0783 -0.0982 -0.3937 -0.4020 -0.3286 0.1032 -0.0327 -0.3682 0.6167 0.2112 -0.0919 -0.0318 -0.1825 -0.3069 0.0220 -0.1228 -0.2209 -0.2178 0.2835 0.1587 0.1943 0.2756 -0.2396 -0.1919 -0.1124 -0.1288 0.0710 0.0912 0.1672 0.1490 0.1133 0.1036 0.0924 0.1069 0.0872 0.1514 0.1276 0.1570 0.1977 0.2051 0.1518 0.1642 0.1465 0.1477 0.2528
va: 1.2389 1.2049 1.9756 1.9668 2.0791 3.3838 3.5154 3.0417 3.8423 3.8250 3.7265 3.9256 3.6066 3.9879 3.9568 3.9441 4.1195 3.9700 3.7917 4.0047 3.9458 3.6941 4.0452 3.9754 3.9489 3.9583 3.8404 1.0037 1.0067 1.0065 1.0018 0.9984 1.0076 1.0071 0.9961 1.0201 1.0281 0.9989 0.9833 0.9726 1.0039 0.9932 1.0020 1.0027 0.9708
dispersion: -0.025394032 hartree
energy: -2045.158897623067 hartree
dipole: 21.57241 -13.46967 8.10274 9.49433 -9.40400 0.09033 -3.35901 4.19593 0.83692
magnitude: 8.14634 au
magnitude: 20.70636 debye
