program: Orca
programVersion: 5.0.2
elementType: Cl Cl O O O N N N C C C C C C C C C C C C C C C C C C C H H H H H H H H H H H H H H H H H H
charge: 1
multiplicity: 1
keywords: wb97x-d3
keywords: def2-TZVPP
keywords: def2/J RIJCOSX
keywords: DEFGRID2
keywords: scfconv7
keywords: smallprint printgap noloewdin
keywords: NOSOSCF
formula: C19H18Cl2N3O3
InChI: InChI=1/C19H18Cl2N3O3/c1-13-9-25-19(27-13,10-24-12-22-11-23-24)17-7-6-16(8-18(17)21)26-15-4-2-14(20)3-5-15/h2-8,11-13,23H,9-10H2,1H3
45 atoms
Cl 0.516962 1.823362 1.736478
Cl -7.244395 0.020189 1.163705
O  3.614239 0.94118 -1.435206
O  2.65764 2.568225 -0.223637
O  -2.01757 -1.755795 -0.797797
N  3.77357 -0.68015 0.98411
N  4.569624 -1.375965 0.165139
N  3.367062 -2.811232 1.276346
C  2.831815 1.187118 -0.29974
C  3.676572 2.129374 -2.240245
C  3.633372 0.762142 0.940836
C  2.657359 3.032436 -1.564449
C  1.50735 0.434398 -0.404101
C  3.377487 1.826618 -3.686378
C  0.43406 0.654398 0.457497
C  1.340664 -0.557851 -1.367952
C  -0.755476 -0.050131 0.357233
C  0.163802 -1.270601 -1.498319
C  -0.891217 -1.007684 -0.637616
C  3.046123 -1.578118 1.631268
C  4.312802 -2.654104 0.363457
C  -3.222526 -1.295389 -0.321875
C  -3.946634 -2.124442 0.51807
C  -3.729367 -0.064751 -0.716463
C  -5.193984 -1.722978 0.972402
C  -4.969024 0.343656 -0.252635
C  -5.692044 -0.489069 0.588388
H  4.68215 2.550149 -2.145931
H  3.135972 1.048003 1.864726
H  4.623994 1.215815 0.929651
H  2.940364 4.083329 -1.572216
H  1.663813 2.929384 -2.016438
H  2.375546 1.414026 -3.810706
H  4.099639 1.126224 -4.10526
H  3.439105 2.746903 -4.268487
H  2.145467 -0.777586 -2.054079
H  -1.556039 0.153444 1.055626
H  0.066104 -2.023972 -2.268554
H  2.304204 -1.293662 2.36071
H  4.835914 -3.43542 -0.163504
H  -3.545125 -3.084046 0.816567
H  -3.169864 0.579551 -1.382752
H  -5.761252 -2.370355 1.626821
H  -5.365923 1.303156 -0.554606
H  5.235018 -0.927794 -0.459183
elementType: Cl O N C H
totalener: -2045.13229936 hartree
nucrepener: 2791.54899851 hartree
electener: -4836.68129787 hartree
oneelecener: -8328.68727786 hartree
twoeener: 3492.00597999 hartree
cpcmener: -0.11709417 hartree
kineticenergy: 2039.00268436 hartree
xcener: -150.068134989219 hartree
chargesum: 1.0000000
charge: -0.074049 -0.097656 -0.413136 -0.370765 -0.325517 0.089103 -0.019427 -0.357447 0.571576 0.136146 -0.098595 0.024334 -0.170247 -0.284503 0.006950 -0.100181 -0.152099 -0.277491 0.305867 0.165764 0.193555 0.271979 -0.236130 -0.191987 -0.114024 -0.127285 0.071156 0.080533 0.147858 0.153234 0.120717 0.085735 0.085119 0.098265 0.103967 0.153729 0.132419 0.148956 0.196468 0.205399 0.151967 0.164006 0.146419 0.147474 0.251844
qa: -0.0740 -0.0977 -0.4131 -0.3708 -0.3255 0.0891 -0.0194 -0.3574 0.5716 0.1361 -0.0986 0.0243 -0.1702 -0.2845 0.0070 -0.1002 -0.1521 -0.2775 0.3059 0.1658 0.1936 0.2720 -0.2361 -0.1920 -0.1140 -0.1273 0.0712 0.0805 0.1479 0.1532 0.1207 0.0857 0.0851 0.0983 0.1040 0.1537 0.1324 0.1490 0.1965 0.2054 0.1520 0.1640 0.1464 0.1475 0.2518
va: 1.2510 1.2051 1.9663 2.0035 2.0853 3.3735 3.5088 3.0345 3.8985 3.9360 3.8030 3.9289 3.5201 3.9546 4.0050 3.8388 3.9605 4.1053 3.7695 3.9946 3.9493 3.6965 4.0447 3.9721 3.9492 3.9569 3.8384 1.0061 1.0137 1.0095 0.9947 1.0049 1.0037 1.0034 1.0057 1.0175 1.0249 1.0076 0.9813 0.9729 1.0037 0.9918 1.0020 1.0027 0.9752
dispersion: -0.026337911 hartree
energy: -2045.158637271529 hartree
dipole: 29.97645 -21.72031 8.25614 2.39776 -3.10341 -0.70564 -18.89713 18.07494 -0.82219
magnitude: 8.32693 au
magnitude: 21.16537 debye
