program: Orca
programVersion: 5.0.2
elementType: Cl Cl O O O N N N C C C C C C C C C C C C C C C C C C C H H H H H H H H H H H H H H H H H H
charge: 1
multiplicity: 1
keywords: wb97x-d3
keywords: def2-TZVPP
keywords: def2/J RIJCOSX
keywords: DEFGRID2
keywords: scfconv7
keywords: smallprint printgap noloewdin
keywords: NOSOSCF
formula: C19H18Cl2N3O3
InChI: InChI=1/C19H18Cl2N3O3/c1-13-9-25-19(27-13,10-24-12-22-11-23-24)17-7-6-16(8-18(17)21)26-15-4-2-14(20)3-5-15/h2-8,11-13,23H,9-10H2,1H3
45 atoms
Cl 0.486255 1.862238 1.675969
Cl -7.185274 -0.011446 1.315169
O  3.635264 0.930736 -1.427916
O  2.671159 2.575689 -0.246834
O  -2.025621 -1.727693 -0.862367
N  3.711775 -0.684204 0.994193
N  4.527395 -1.386022 0.200447
N  3.263838 -2.811079 1.255104
C  2.82921 1.192708 -0.312766
C  3.736561 2.113531 -2.235755
C  3.594924 0.758985 0.948731
C  2.718161 3.03838 -1.587356
C  1.500255 0.453788 -0.441255
C  3.464228 1.80618 -3.686494
C  0.417443 0.683529 0.405344
C  1.341236 -0.54344 -1.401787
C  -0.771535 -0.020043 0.297581
C  0.164243 -1.253547 -1.540981
C  -0.899776 -0.983919 -0.692326
C  2.946135 -1.576055 1.605928
C  4.246972 -2.661656 0.38036
C  -3.221721 -1.287994 -0.343121
C  -3.906369 -2.131271 0.515177
C  -3.752241 -0.058978 -0.709481
C  -5.138208 -1.742343 1.019962
C  -4.975541 0.337132 -0.194724
C  -5.657746 -0.50729 0.66874
H  4.747123 2.51721 -2.121716
H  3.079983 1.054668 1.859671
H  4.5923 1.197468 0.961085
H  3.025251 4.082572 -1.586433
H  1.735673 2.958132 -2.067263
H  4.192806 1.10213 -4.087909
H  3.538363 2.723154 -4.272233
H  2.464071 1.394539 -3.826919
H  2.154948 -0.769582 -2.075342
H  -1.577656 0.189788 0.98732
H  0.071487 -2.012233 -2.306765
H  2.179459 -1.289083 2.308493
H  4.776849 -3.448667 -0.131047
H  -3.486639 -3.09057 0.788436
H  -3.2205 0.593964 -1.389865
H  -5.677433 -2.399215 1.68849
H  -5.389998 1.296862 -0.471397
H  5.229279 -0.942121 -0.386969
elementType: Cl O N C H
totalener: -2045.13198955 hartree
nucrepener: 2795.06400054 hartree
electener: -4840.19599009 hartree
oneelecener: -8335.71661911 hartree
twoeener: 3495.52062902 hartree
cpcmener: -0.11693278 hartree
kineticenergy: 2039.00842946 hartree
xcener: -150.069424125748 hartree
chargesum: 1.0000000
charge: -0.073731 -0.097197 -0.413330 -0.371281 -0.324758 0.090114 -0.019590 -0.357826 0.574126 0.135665 -0.099312 0.025654 -0.172430 -0.285237 0.002143 -0.099832 -0.154700 -0.278582 0.314141 0.163551 0.193822 0.273028 -0.232876 -0.196050 -0.115140 -0.126650 0.071471 0.080825 0.148807 0.152336 0.119955 0.085580 0.098381 0.103852 0.085229 0.153668 0.131012 0.148659 0.197110 0.205254 0.152370 0.164306 0.146937 0.148180 0.252345
qa: -0.0737 -0.0972 -0.4133 -0.3713 -0.3248 0.0901 -0.0196 -0.3578 0.5741 0.1357 -0.0993 0.0257 -0.1724 -0.2852 0.0021 -0.0998 -0.1547 -0.2786 0.3141 0.1636 0.1938 0.2730 -0.2329 -0.1960 -0.1151 -0.1267 0.0715 0.0808 0.1488 0.1523 0.1200 0.0856 0.0984 0.1039 0.0852 0.1537 0.1310 0.1487 0.1971 0.2053 0.1524 0.1643 0.1469 0.1482 0.2523
va: 1.2516 1.2057 1.9670 2.0036 2.0887 3.3714 3.5104 3.0333 3.8994 3.9366 3.8023 3.9274 3.5264 3.9548 4.0125 3.8392 3.9583 4.1065 3.7667 3.9963 3.9492 3.6926 4.0450 3.9758 3.9486 3.9552 3.8398 1.0056 1.0139 1.0101 0.9946 1.0048 1.0033 1.0058 1.0036 1.0175 1.0264 1.0078 0.9808 0.9730 1.0034 0.9918 1.0021 1.0026 0.9744
dispersion: -0.026410238 hartree
energy: -2045.158399785589 hartree
dipole: 30.22440 -22.02518 8.19922 2.27521 -3.01866 -0.74345 -19.02397 18.25640 -0.76757
magnitude: 8.26856 au
magnitude: 21.01702 debye
