program: Orca
programVersion: 5.0.2
elementType: Cl Cl O O O N N N C C C C C C C C C C C C C C C C C C C H H H H H H H H H H H H H H H H H H
charge: 1
multiplicity: 1
keywords: wb97x-d3
keywords: def2-TZVPP
keywords: def2/J RIJCOSX
keywords: DEFGRID2
keywords: scfconv7
keywords: smallprint printgap noloewdin
keywords: NOSOSCF
formula: C19H18Cl2N3O3
InChI: InChI=1/C19H18Cl2N3O3/c1-13-9-25-19(27-13,10-24-12-22-11-23-24)17-7-6-16(8-18(17)21)26-15-4-2-14(20)3-5-15/h2-8,11-13,23H,9-10H2,1H3
45 atoms
Cl 0.420761 2.402212 1.0084
Cl -6.993405 -0.501946 1.981069
O  3.778042 0.672745 -1.469107
O  2.861453 2.561037 -0.695444
O  -2.117817 -1.437473 -1.127069
N  3.488753 -0.48641 1.191885
N  4.277375 -1.387313 0.596038
N  2.846134 -2.483707 1.814652
C  2.897382 1.181534 -0.505614
C  3.968134 1.651259 -2.504046
C  3.504388 0.928925 0.883356
C  3.006945 2.758569 -2.092279
C  1.524906 0.526958 -0.648546
C  3.695284 1.072453 -3.869752
C  0.380595 0.9979 -0.009202
C  1.382153 -0.632241 -1.410441
C  -0.853371 0.376332 -0.138445
C  0.171981 -1.282503 -1.544856
C  -0.95282 -0.771071 -0.911918
C  2.621269 -1.183682 1.908641
C  3.873912 -2.580037 0.987065
C  -3.231598 -1.172272 -0.363718
C  -3.242234 -1.430051 0.999435
C  -4.365584 -0.70827 -1.008488
C  -4.402702 -1.215449 1.725537
C  -5.531533 -0.504619 -0.285946
C  -5.539026 -0.756465 1.076143
H  5.003027 1.999794 -2.445913
H  2.935806 1.418913 1.670296
H  4.530741 1.29193 0.924972
H  3.40263 3.757631 -2.265344
H  2.042104 2.666609 -2.604625
H  2.669219 0.712977 -3.955228
H  4.374582 0.251602 -4.097805
H  3.847184 1.843368 -4.626147
H  2.241074 -1.046131 -1.918475
H  -1.716098 0.797885 0.359415
H  0.097642 -2.179107 -2.145713
H  1.8529 -0.708359 2.497264
H  4.355232 -3.487718 0.661337
H  -2.356838 -1.801084 1.499642
H  -4.347566 -0.513661 -2.072657
H  -4.416513 -1.415131 2.788147
H  -6.420546 -0.148273 -0.787641
H  5.030198 -1.119905 -0.031566
elementType: Cl O N C H
totalener: -2045.13191217 hartree
nucrepener: 2797.34397011 hartree
electener: -4842.47588229 hartree
oneelecener: -8340.13041027 hartree
twoeener: 3497.65452798 hartree
cpcmener: -0.11719788 hartree
kineticenergy: 2039.00931672 hartree
xcener: -150.069380573094 hartree
chargesum: 1.0000000
charge: -0.073245 -0.096681 -0.413011 -0.370424 -0.322499 0.089243 -0.020623 -0.358043 0.569347 0.137297 -0.085782 0.017834 -0.169235 -0.288463 -0.004935 -0.110920 -0.157410 -0.282306 0.327733 0.168891 0.194422 0.270974 -0.199915 -0.224927 -0.127774 -0.120205 0.076921 0.083632 0.145596 0.151330 0.120406 0.087862 0.086040 0.098492 0.105049 0.156202 0.127626 0.148339 0.195985 0.204694 0.163651 0.151961 0.148171 0.147646 0.251056
qa: -0.0732 -0.0967 -0.4130 -0.3704 -0.3225 0.0892 -0.0206 -0.3580 0.5693 0.1373 -0.0858 0.0178 -0.1692 -0.2885 -0.0049 -0.1109 -0.1574 -0.2823 0.3277 0.1689 0.1944 0.2710 -0.1999 -0.2249 -0.1278 -0.1202 0.0769 0.0836 0.1456 0.1513 0.1204 0.0879 0.0860 0.0985 0.1050 0.1562 0.1276 0.1483 0.1960 0.2047 0.1637 0.1520 0.1482 0.1476 0.2511
va: 1.2523 1.2060 1.9623 2.0010 2.0912 3.3764 3.5067 3.0318 3.9029 3.9301 3.7950 3.9299 3.5204 3.9554 4.0387 3.8403 3.9651 4.1108 3.7633 3.9901 3.9504 3.6914 3.9832 4.0444 3.9535 3.9509 3.8372 1.0050 1.0130 1.0113 0.9949 1.0043 1.0020 1.0036 1.0060 1.0154 1.0294 1.0086 0.9812 0.9734 0.9936 1.0031 1.0025 1.0019 0.9765
dispersion: -0.026518944 hartree
energy: -2045.158431118649 hartree
dipole: 30.70662 -22.82500 7.88161 -0.52676 -0.46379 -0.99055 -19.37417 19.00295 -0.37122
magnitude: 7.95228 au
magnitude: 20.21309 debye
