program: Orca
programVersion: 5.0.2
elementType: Cl Cl O O O N N N C C C C C C C C C C C C C C C C C C C H H H H H H H H H H H H H H H H H H
charge: 1
multiplicity: 1
keywords: wb97x-d3
keywords: def2-TZVPP
keywords: def2/J RIJCOSX
keywords: DEFGRID2
keywords: scfconv7
keywords: smallprint printgap noloewdin
keywords: NOSOSCF
formula: C19H18Cl2N3O3
InChI: InChI=1/C19H18Cl2N3O3/c1-13-9-25-19(27-13,10-24-12-22-11-23-24)17-7-6-16(8-18(17)21)26-15-4-2-14(20)3-5-15/h2-8,11-13,23H,9-10H2,1H3
45 atoms
Cl 0.822627 -1.70787 -1.648533
Cl -7.119895 -1.905374 -0.063295
O  2.915766 0.308981 -2.33093
O  3.62682 1.715164 -0.721883
O  -2.217667 0.920285 1.449305
N  3.678249 -0.468104 1.170774
N  4.33714 0.478352 1.8484
N  3.034559 -0.543333 3.261617
C  2.921934 0.528838 -0.94993
C  3.620606 1.375051 -2.983613
C  3.714769 -0.604891 -0.272093
C  3.593372 2.462202 -1.929672
C  1.506282 0.619324 -0.391538
C  2.944098 1.738838 -4.280025
C  0.525241 -0.341558 -0.622607
C  1.16889 1.664361 0.466229
C  -0.729551 -0.279639 -0.035618
C  -0.079213 1.765096 1.048994
C  -1.03105 0.78673 0.799156
C  2.885064 -1.057855 2.052089
C  3.940832 0.408281 3.104028
C  -3.334608 0.229382 1.044439
C  -3.814196 0.316347 -0.255246
C  -4.014858 -0.50186 2.004004
C  -4.980272 -0.348676 -0.598241
C  -5.189183 -1.156453 1.665788
C  -5.658863 -1.079915 0.364958
H  4.651587 1.057562 -3.173264
H  4.752532 -0.598005 -0.604359
H  3.290885 -1.581308 -0.495145
H  4.460843 3.118667 -1.959436
H  2.682214 3.067759 -1.994382
H  2.941779 0.901792 -4.977584
H  3.48592 2.557953 -4.753471
H  1.915348 2.061426 -4.116231
H  1.897624 2.431452 0.685124
H  -1.44858 -1.063491 -0.230911
H  -0.30996 2.593877 1.704986
H  2.223932 -1.864308 1.776471
H  4.33281 1.05711 3.870393
H  -3.292099 0.899044 -1.003385
H  -3.637597 -0.556046 3.016672
H  -5.355377 -0.286006 -1.610448
H  -5.724241 -1.723031 2.415262
H  5.017681 1.086735 1.401711
elementType: Cl O N C H
totalener: -2045.13227675 hartree
nucrepener: 2781.57618004 hartree
electener: -4826.70845679 hartree
oneelecener: -8308.97057956 hartree
twoeener: 3482.26212277 hartree
cpcmener: -0.11809593 hartree
kineticenergy: 2039.00612438 hartree
xcener: -150.068353530006 hartree
chargesum: 1.0000000
charge: -0.074032 -0.097677 -0.390454 -0.405736 -0.322510 0.087772 -0.016857 -0.357534 0.611279 0.163920 -0.122540 -0.001271 -0.166418 -0.279222 -0.033254 -0.061030 -0.161820 -0.288183 0.327086 0.165693 0.193345 0.297375 -0.214223 -0.247202 -0.120577 -0.110136 0.065872 0.076662 0.155163 0.143864 0.116196 0.091802 0.098471 0.096757 0.082532 0.150776 0.132802 0.148538 0.196651 0.205128 0.164377 0.151230 0.148709 0.147743 0.250933
qa: -0.0740 -0.0977 -0.3905 -0.4057 -0.3225 0.0878 -0.0169 -0.3575 0.6113 0.1639 -0.1225 -0.0013 -0.1664 -0.2792 -0.0333 -0.0610 -0.1618 -0.2882 0.3271 0.1657 0.1933 0.2974 -0.2142 -0.2472 -0.1206 -0.1101 0.0659 0.0767 0.1552 0.1439 0.1162 0.0918 0.0985 0.0968 0.0825 0.1508 0.1328 0.1485 0.1967 0.2051 0.1644 0.1512 0.1487 0.1477 0.2509
va: 1.2511 1.2050 2.0076 1.9642 2.0928 3.3766 3.5067 3.0329 3.8072 3.9060 3.8553 3.9517 3.6317 3.9601 4.0610 3.7882 3.9795 4.0946 3.7608 3.9926 3.9495 3.6680 3.9809 4.0539 3.9489 3.9440 3.8434 1.0027 1.0051 1.0165 0.9994 1.0002 1.0029 1.0053 1.0083 1.0200 1.0245 1.0086 0.9811 0.9731 0.9920 1.0047 1.0023 1.0016 0.9754
dispersion: -0.025778820 hartree
energy: -2045.158055570906 hartree
dipole: 29.15752 -20.87473 8.28279 17.12710 -15.42064 1.70646 -6.91791 8.33103 1.41312
magnitude: 8.57400 au
magnitude: 21.79338 debye
