program: Orca
programVersion: 5.0.2
elementType: Cl Cl O O O N N N C C C C C C C C C C C C C C C C C C C H H H H H H H H H H H H H H H H H H
charge: 1
multiplicity: 1
keywords: wb97x-d3
keywords: def2-TZVPP
keywords: def2/J RIJCOSX
keywords: DEFGRID2
keywords: scfconv7
keywords: smallprint printgap noloewdin
keywords: NOSOSCF
formula: C19H18Cl2N3O3
InChI: InChI=1/C19H18Cl2N3O3/c1-13-9-25-19(27-13,10-24-12-22-11-23-24)17-7-6-16(8-18(17)21)26-15-4-2-14(20)3-5-15/h2-8,11-13,23H,9-10H2,1H3
45 atoms
Cl 2.063599 2.434563 2.27508
Cl -6.553286 -2.939582 -0.725337
O  3.065052 0.645459 -1.763816
O  3.437017 2.378821 -0.373008
O  -2.520981 0.853878 1.185432
N  3.241526 -1.19795 0.431388
N  3.335793 -2.026482 -0.613985
N  2.01685 -2.965233 0.841219
C  2.921585 1.082283 -0.44119
C  3.507429 1.737581 -2.578061
C  3.776503 0.148735 0.444363
C  4.205155 2.607803 -1.549101
C  1.461833 1.056438 -0.013368
C  2.351598 2.413665 -3.283276
C  1.001284 1.60647 1.183177
C  0.520426 0.408936 -0.807737
C  -0.323124 1.513526 1.570444
C  -0.814689 0.31345 -0.453685
C  -1.233299 0.864032 0.748014
C  2.422712 -1.788095 1.288646
C  2.597299 -3.084649 -0.342376
C  -3.420383 -0.060708 0.69146
C  -3.169491 -1.424868 0.742324
C  -4.623927 0.421832 0.204767
C  -4.13429 -2.313362 0.296209
C  -5.595863 -0.466768 -0.22933
C  -5.341576 -1.827477 -0.183271
H  4.211429 1.332966 -3.306105
H  3.775268 0.46569 1.484586
H  4.808821 0.123902 0.095261
H  5.247541 2.309013 -1.402298
H  4.172615 3.671489 -1.782034
H  2.732282 3.188595 -3.949378
H  1.659725 2.883766 -2.582755
H  1.794617 1.700839 -3.891573
H  0.826702 -0.033047 -1.744475
H  -0.65505 1.947708 2.504288
H  -1.503746 -0.185014 -1.121459
H  2.158013 -1.335881 2.231665
H  2.510074 -3.918166 -1.020157
H  -2.232421 -1.804149 1.129667
H  -4.810824 1.487149 0.171197
H  -3.942276 -3.376845 0.333466
H  -6.538319 -0.092222 -0.604318
H  3.904197 -1.80411 -1.426842
elementType: Cl O N C H
totalener: -2045.13167729 hartree
nucrepener: 2794.22467144 hartree
electener: -4839.35634872 hartree
oneelecener: -8333.83129913 hartree
twoeener: 3494.47495041 hartree
cpcmener: -0.12076842 hartree
kineticenergy: 2039.00608039 hartree
xcener: -150.068846764602 hartree
chargesum: 1.0000000
charge: -0.075280 -0.097928 -0.423451 -0.377893 -0.326190 0.093590 -0.016866 -0.362783 0.582809 0.175645 -0.117801 0.013511 -0.136787 -0.307328 0.003111 -0.098427 -0.220801 -0.226786 0.308396 0.165984 0.192512 0.292953 -0.205549 -0.243310 -0.124374 -0.110948 0.069151 0.092607 0.140732 0.153347 0.095310 0.104392 0.104929 0.096072 0.095015 0.149723 0.128519 0.156760 0.196332 0.204653 0.160008 0.151604 0.147039 0.146757 0.251041
qa: -0.0753 -0.0979 -0.4235 -0.3779 -0.3262 0.0936 -0.0169 -0.3628 0.5828 0.1756 -0.1178 0.0135 -0.1368 -0.3073 0.0031 -0.0984 -0.2208 -0.2268 0.3084 0.1660 0.1925 0.2930 -0.2055 -0.2433 -0.1244 -0.1109 0.0692 0.0926 0.1407 0.1533 0.0953 0.1044 0.1049 0.0961 0.0950 0.1497 0.1285 0.1568 0.1963 0.2047 0.1600 0.1516 0.1470 0.1468 0.2510
va: 1.2466 1.2048 1.9647 1.9965 2.0862 3.3757 3.5087 3.0227 3.8620 3.9116 3.8712 3.9883 3.5267 3.9532 4.0118 3.8246 4.1297 4.0076 3.7865 3.9850 3.9504 3.6720 3.9788 4.0485 3.9558 3.9456 3.8397 1.0002 1.0181 0.9999 0.9974 0.9922 1.0083 0.9989 1.0068 1.0242 1.0271 0.9990 0.9806 0.9732 0.9969 1.0042 1.0029 1.0019 0.9749
dispersion: -0.026399271 hartree
energy: -2045.158076556603 hartree
dipole: 23.25581 -16.16756 7.08825 6.76610 -8.61882 -1.85272 -16.09986 14.13287 -1.96699
magnitude: 7.58584 au
magnitude: 19.28166 debye
