program: Orca
programVersion: 5.0.2
elementType: Cl Cl O O O N N N C C C C C C C C C C C C C C C C C C C H H H H H H H H H H H H H H H H H H
charge: 1
multiplicity: 1
keywords: wb97x-d3
keywords: def2-TZVPP
keywords: def2/J RIJCOSX
keywords: DEFGRID2
keywords: scfconv7
keywords: smallprint printgap noloewdin
keywords: NOSOSCF
formula: C19H18Cl2N3O3
InChI: InChI=1/C19H18Cl2N3O3/c1-13-9-25-19(27-13,10-24-12-22-11-23-24)17-7-6-16(8-18(17)21)26-15-4-2-14(20)3-5-15/h2-8,11-13,22H,9-10H2,1H3
45 atoms
Cl -2.067211 -1.247597 -2.98221
Cl 6.63937 1.025274 2.564794
O  -3.402613 -2.133664 -0.453141
O  -3.161837 -0.892365 1.373982
O  2.396731 0.249645 -1.393255
N  -3.666713 1.460523 -0.082192
N  -3.035048 2.351941 -0.857125
N  -3.322144 3.14306 1.149722
C  -2.992951 -0.890573 -0.016312
C  -3.077605 -3.088303 0.555888
C  -3.989506 0.131757 -0.582533
C  -2.910356 -2.219985 1.819355
C  -1.554615 -0.557757 -0.390903
C  -1.847903 -3.898952 0.206709
C  -1.057734 -0.705252 -1.688972
C  -0.667102 -0.087303 0.570491
C  0.26015 -0.432777 -1.998195
C  0.658626 0.196555 0.288231
C  1.130061 0.010077 -1.006061
C  -3.841983 1.917913 1.136027
C  -2.830387 3.37712 -0.099129
C  3.374778 0.423684 -0.44185
C  3.963285 1.669232 -0.312902
C  3.792759 -0.643615 0.338546
C  4.980368 1.854594 0.610985
C  4.8016 -0.456552 1.268124
C  5.387927 0.793834 1.404636
H  -3.941658 -3.750141 0.644511
H  -5.00335 -0.125149 -0.276028
H  -3.945779 0.180969 -1.66733
H  -3.629069 -2.460779 2.602534
H  -1.901337 -2.304424 2.234644
H  -0.958502 -3.273967 0.122528
H  -1.985818 -4.427628 -0.735223
H  -1.663203 -4.645975 0.980121
H  -1.008221 0.04605 1.588364
H  0.624501 -0.568166 -3.00762
H  1.311068 0.545923 1.076388
H  -4.309884 1.401949 1.957733
H  -2.345232 4.289891 -0.402377
H  3.642635 2.488158 -0.94317
H  3.345126 -1.621723 0.217028
H  5.453348 2.821477 0.710855
H  5.138082 -1.283586 1.877679
H  -3.307021 3.772584 1.93993
totalener: -2045.04768391 hartree
nucrepener: 2795.84827984 hartree
electener: -4840.89596375 hartree
oneelecener: -8338.94740711 hartree
twoeener: 3498.05144336 hartree
kineticenergy: 2039.08388911 hartree
xcener: -150.079556168238 hartree
chargesum: 1.0000000
charge: -0.028874 -0.047066 -0.317500 -0.397741 -0.280971 0.120926 -0.216360 -0.118409 0.606069 0.192174 -0.123603 -0.081842 -0.289068 -0.289586 0.046103 -0.141592 -0.171812 -0.197129 0.251145 0.161624 0.146981 0.222132 -0.186714 -0.169161 -0.101131 -0.107832 0.059365 0.096084 0.139813 0.158552 0.110995 0.103191 0.081010 0.108699 0.103564 0.141343 0.132787 0.141025 0.207885 0.190217 0.133051 0.137506 0.132050 0.133296 0.208804
qa: -0.0289 -0.0471 -0.3175 -0.3977 -0.2810 0.1209 -0.2164 -0.1184 0.6061 0.1922 -0.1236 -0.0818 -0.2891 -0.2896 0.0461 -0.1416 -0.1718 -0.1971 0.2511 0.1616 0.1470 0.2221 -0.1867 -0.1692 -0.1011 -0.1078 0.0594 0.0961 0.1398 0.1586 0.1110 0.1032 0.0810 0.1087 0.1036 0.1413 0.1328 0.1410 0.2079 0.1902 0.1331 0.1375 0.1321 0.1333 0.2088
va: 1.3019 1.2570 2.0539 1.9493 2.1358 3.4567 2.8954 3.5514 3.8313 3.8329 3.7686 3.9671 3.5282 3.9852 4.0479 3.8676 4.0835 4.0290 3.9002 3.9347 3.9183 3.7925 4.0371 4.0011 3.9670 3.9716 3.9868 0.9969 1.0226 1.0307 1.0034 0.9939 0.9948 1.0097 1.0102 1.0194 1.0245 1.0092 0.9911 0.9808 1.0090 1.0029 1.0085 1.0087 0.9918
dispersion: -0.026217204 hartree
energy: -2045.073901116626 hartree
dipole: -19.26126 14.18349 -5.07777 -8.23708 11.05355 2.81647 8.58917 -6.40540 2.18377
magnitude: 6.20364 au
magnitude: 15.76841 debye
