program: Orca
programVersion: 5.0.2
elementType: Cl Cl O O O N N N C C C C C C C C C C C C C C C C C C C H H H H H H H H H H H H H H H H H H
charge: 1
multiplicity: 1
keywords: wb97x-d3
keywords: def2-TZVPP
keywords: def2/J RIJCOSX
keywords: DEFGRID2
keywords: scfconv7
keywords: smallprint printgap noloewdin
keywords: NOSOSCF
formula: C19H18Cl2N3O3
InChI: InChI=1/C19H18Cl2N3O3/c1-13-9-25-19(27-13,10-24-12-22-11-23-24)17-7-6-16(8-18(17)21)26-15-4-2-14(20)3-5-15/h2-8,11-13,22H,9-10H2,1H3
45 atoms
Cl -2.60839 0.64421 2.810932
Cl 7.12147 0.022395 -1.44856
O  -2.916221 -1.800327 -0.976406
O  -3.552853 -1.75016 1.179369
O  2.1370 1.061545 1.436405
N  -3.487125 1.123815 -1.026518
N  -3.565196 0.973016 -2.355255
N  -2.35277 2.709183 -1.845066
C  -3.007422 -0.991801 0.152244
C  -3.360499 -3.12255 -0.648823
C  -4.037221 0.133546 -0.118716
C  -3.286676 -3.105662 0.870252
C  -1.627055 -0.438082 0.494586
C  -2.492207 -4.154638 -1.32421
C  -1.359955 0.277869 1.664935
C  -0.557277 -0.624342 -0.376976
C  -0.098916 0.759874 1.957965
C  0.715823 -0.144835 -0.114299
C  0.952352 0.543671 1.070172
C  -2.749469 2.160263 -0.699978
C  -2.874571 1.947238 -2.847192
C  3.278644 0.781297 0.720307
C  3.823484 -0.493368 0.721634
C  3.907124 1.820932 0.058198
C  5.007105 -0.729315 0.042271
C  5.097512 1.587462 -0.61188
C  5.641089 0.312383 -0.620449
H  -4.400163 -3.237492 -0.97816
H  -4.317693 0.637028 0.803257
H  -4.930538 -0.278614 -0.583403
H  -4.0393 -3.72651 1.353481
H  -2.294969 -3.405947 1.229653
H  -1.452202 -4.068082 -1.008802
H  -2.535587 -4.060485 -2.408211
H  -2.840723 -5.156008 -1.070998
H  -0.719542 -1.172983 -1.293855
H  0.083616 1.29236 2.88191
H  1.509981 -0.324199 -0.825865
H  -2.524302 2.500624 0.298429
H  -2.7321 2.141698 -3.897167
H  3.340355 -1.298476 1.260383
H  3.482957 2.815897 0.084397
H  5.443758 -1.718145 0.041689
H  5.602415 2.396694 -1.120403
H  -1.776721 3.533482 -1.940237
totalener: -2045.04834682 hartree
nucrepener: 2781.77574087 hartree
electener: -4826.82408769 hartree
oneelecener: -8310.14038907 hartree
twoeener: 3483.31630138 hartree
kineticenergy: 2039.07912031 hartree
xcener: -150.077625916222 hartree
chargesum: 1.0000000
charge: -0.029349 -0.042486 -0.359609 -0.312921 -0.278970 0.133588 -0.213036 -0.112126 0.567287 0.092832 -0.189532 0.032830 -0.162346 -0.256252 -0.066175 -0.149120 -0.178732 -0.187911 0.266004 0.151459 0.142673 0.246832 -0.190390 -0.198341 -0.095783 -0.094100 0.053821 0.075990 0.169191 0.134281 0.114478 0.077916 0.077210 0.103201 0.101977 0.154793 0.137977 0.147835 0.205172 0.189002 0.140296 0.127301 0.134829 0.131425 0.206979
qa: -0.0293 -0.0425 -0.3596 -0.3129 -0.2790 0.1336 -0.2130 -0.1121 0.5673 0.0928 -0.1895 0.0328 -0.1623 -0.2563 -0.0662 -0.1491 -0.1787 -0.1879 0.2660 0.1515 0.1427 0.2468 -0.1904 -0.1983 -0.0958 -0.0941 0.0538 0.0760 0.1692 0.1343 0.1145 0.0779 0.0772 0.1032 0.1020 0.1548 0.1380 0.1478 0.2052 0.1890 0.1403 0.1273 0.1348 0.1314 0.2070
va: 1.2988 1.2616 2.0089 2.0587 2.1362 3.4411 2.9187 3.5507 3.8881 3.9572 3.8416 3.9218 3.5186 3.9583 4.0148 3.9250 4.0515 3.9718 3.8909 3.9336 3.9266 3.7529 4.0062 4.0576 3.9611 3.9713 4.0006 1.0008 1.0041 1.0265 0.9975 1.0062 1.0083 1.0045 1.0084 1.0219 1.0221 1.0080 0.9864 0.9816 1.0017 1.0105 1.0079 1.0087 0.9930
dispersion: -0.025635295 hartree
energy: -2045.073982115796 hartree
dipole: -19.62012 15.96209 -3.65803 -13.08585 15.25030 2.16445 -8.52042 6.42176 -2.09865
magnitude: 4.74029 au
magnitude: 12.04886 debye
