program: Orca
programVersion: 5.0.2
elementType: Cl Cl O O O N N N C C C C C C C C C C C C C C C C C C C H H H H H H H H H H H H H H H H H H
charge: 1
multiplicity: 1
keywords: wb97x-d3
keywords: def2-TZVPP
keywords: def2/J RIJCOSX
keywords: DEFGRID2
keywords: scfconv7
keywords: smallprint printgap noloewdin
keywords: NOSOSCF
formula: C19H18Cl2N3O3
InChI: InChI=1/C19H18Cl2N3O3/c1-13-9-25-19(27-13,10-24-12-22-11-23-24)17-7-6-16(8-18(17)21)26-15-4-2-14(20)3-5-15/h2-8,11-13,22H,9-10H2,1H3
45 atoms
Cl -0.347797 0.415691 -1.807532
Cl 7.420767 0.321269 -1.265214
O  -2.81026 -0.895519 -0.85471
O  -3.467783 -0.670298 1.245324
O  2.717938 -0.101752 2.192954
N  -4.426486 1.288924 -0.579995
N  -5.516912 1.542365 0.155302
N  -6.068923 0.946208 -1.86449
C  -2.620942 -0.12096 0.290491
C  -3.055806 -2.240346 -0.435126
C  -3.095744 1.307715 0.002926
C  -3.430548 -2.07327 1.051329
C  -1.173547 -0.084825 0.749753
C  -1.860862 -3.138622 -0.668087
C  -0.10262 0.125255 -0.114477
C  -0.872017 -0.249282 2.101614
C  1.210656 0.128454 0.324967
C  0.425025 -0.253379 2.567728
C  1.478341 -0.076837 1.67406
C  -4.739839 0.916412 -1.799336
C  -6.5153 1.334461 -0.636194
C  3.808729 -0.005314 1.358529
C  4.257886 -1.122901 0.673599
C  4.464974 1.208161 1.248943
C  5.37586 -1.022212 -0.138169
C  5.586987 1.30799 0.441683
C  6.032972 0.194247 -0.253769
H  -3.907025 -2.601718 -1.018607
H  -2.419765 1.810846 -0.686071
H  -3.151813 1.883038 0.924119
H  -4.410155 -2.480275 1.300337
H  -2.686255 -2.542516 1.703079
H  -1.588719 -3.168789 -1.721965
H  -2.09755 -4.157512 -0.358652
H  -0.992479 -2.808236 -0.098603
H  -1.677312 -0.38589 2.810564
H  2.008867 0.292164 -0.385672
H  0.632819 -0.393236 3.619808
H  -4.056091 0.651601 -2.588652
H  -7.553776 1.452327 -0.374926
H  3.747777 -2.071643 0.779459
H  4.111888 2.06872 1.801758
H  5.738266 -1.888726 -0.67342
H  6.112438 2.24869 0.355813
H  -6.627779 0.726601 -2.676856
totalener: -2045.05134798 hartree
nucrepener: 2757.72031307 hartree
electener: -4802.77166105 hartree
oneelecener: -8263.23492629 hartree
twoeener: 3460.46326524 hartree
kineticenergy: 2039.09490582 hartree
xcener: -150.081697231480 hartree
chargesum: 1.0000000
charge: -0.058940 -0.048173 -0.382095 -0.335167 -0.278356 0.129266 -0.219040 -0.125975 0.613668 0.175799 -0.167256 -0.059278 -0.245216 -0.278316 -0.053301 -0.078001 -0.131618 -0.219159 0.268408 0.159783 0.141335 0.203063 -0.165101 -0.163234 -0.112051 -0.108076 0.068739 0.080445 0.171880 0.148222 0.107433 0.105502 0.099219 0.106726 0.089239 0.150750 0.127278 0.141374 0.209104 0.191001 0.134036 0.134620 0.131700 0.132147 0.207617
qa: -0.0589 -0.0482 -0.3821 -0.3352 -0.2784 0.1293 -0.2190 -0.1260 0.6137 0.1758 -0.1673 -0.0593 -0.2452 -0.2783 -0.0533 -0.0780 -0.1316 -0.2192 0.2684 0.1598 0.1413 0.2031 -0.1651 -0.1632 -0.1121 -0.1081 0.0687 0.0804 0.1719 0.1482 0.1074 0.1055 0.0992 0.1067 0.0892 0.1508 0.1273 0.1414 0.2091 0.1910 0.1340 0.1346 0.1317 0.1321 0.2076
va: 1.2719 1.2559 1.9570 2.0327 2.1454 3.4484 2.9172 3.5473 3.8446 3.8213 3.7102 3.9555 3.5351 3.9955 4.0887 3.9145 3.9286 4.0842 3.8962 3.9342 3.9233 3.8117 4.0089 4.0301 3.9772 3.9750 3.9796 0.9995 1.0089 1.0224 1.0022 0.9970 1.0107 1.0085 0.9972 1.0138 1.0295 1.0137 0.9893 0.9803 1.0048 1.0072 1.0093 1.0088 0.9923
dispersion: -0.025548571 hartree
energy: -2045.076896551676 hartree
dipole: -27.73219 19.80468 -7.92751 -11.46159 11.88893 0.42734 6.53812 -8.44431 -1.90619
magnitude: 8.16466 au
magnitude: 20.75290 debye
