program: Orca
programVersion: 5.0.2
elementType: Cl Cl O O O N N N C C C C C C C C C C C C C C C C C C C H H H H H H H H H H H H H H H H H H
charge: 1
multiplicity: 1
keywords: wb97x-d3
keywords: def2-TZVPP
keywords: def2/J RIJCOSX
keywords: DEFGRID2
keywords: scfconv7
keywords: smallprint printgap noloewdin
keywords: NOSOSCF
formula: C19H18Cl2N3O3
InChI: InChI=1/C19H18Cl2N3O3/c1-13-9-25-19(27-13,10-24-12-22-11-23-24)17-7-6-16(8-18(17)21)26-15-4-2-14(20)3-5-15/h2-8,11-13,22H,9-10H2,1H3
45 atoms
Cl -1.60887 0.933275 -2.816512
Cl 7.421481 -0.843241 2.463158
O  -3.114664 -0.779951 -0.950237
O  -2.669033 -0.757175 1.216259
O  3.035052 0.75961 -1.064449
N  -4.605197 1.122596 0.339752
N  -5.19714 1.200162 1.538989
N  -6.627948 0.6107 0.007455
C  -2.468161 -0.041712 0.04281
C  -2.991216 -2.165212 -0.616529
C  -3.172547 1.311638 0.187803
C  -2.574781 -2.12649 0.866742
C  -0.995995 0.189253 -0.25477
C  -2.005009 -2.882405 -1.510921
C  -0.525543 0.603644 -1.502729
C  -0.04904 0.012699 0.748675
C  0.820182 0.781273 -1.750762
C  1.306435 0.186573 0.530003
C  1.746806 0.56109 -0.734396
C  -5.450705 0.757292 -0.595833
C  -6.432633 0.891421 1.326978
C  4.033478 0.368984 -0.201392
C  4.338901 -0.974644 -0.051715
C  4.759445 1.340789 0.463874
C  5.383241 -1.34969 0.776664
C  5.809434 0.96616 1.287653
C  6.114808 -0.377009 1.442882
H  -3.984024 -2.608357 -0.734977
H  -2.993375 1.938224 -0.683899
H  -2.818304 1.832103 1.074399
H  -3.237147 -2.694504 1.519228
H  -1.553783 -2.498451 1.002091
H  -2.299778 -2.817446 -2.557098
H  -1.96492 -3.939471 -1.244236
H  -0.999911 -2.472307 -1.411671
H  -0.37567 -0.273863 1.73937
H  1.162676 1.09126 -2.728673
H  2.003253 0.033274 1.342346
H  -5.233462 0.615934 -1.64148
H  -7.205156 0.859208 2.07714
H  3.777572 -1.727711 -0.589613
H  4.519396 2.386859 0.328173
H  5.635109 -2.394252 0.894309
H  6.388716 1.718358 1.804221
H  -7.495867 0.349396 -0.438583
totalener: -2045.05156594 hartree
nucrepener: 2736.46635226 hartree
electener: -4781.51791819 hartree
oneelecener: -8220.76008533 hartree
twoeener: 3439.24216714 hartree
kineticenergy: 2039.09038341 hartree
xcener: -150.080772916756 hartree
chargesum: 1.0000000
charge: -0.060644 -0.048493 -0.380336 -0.337880 -0.280819 0.128769 -0.218465 -0.126481 0.621813 0.172534 -0.167654 -0.056204 -0.236970 -0.277607 -0.000276 -0.116830 -0.178070 -0.180191 0.246303 0.159833 0.141602 0.207856 -0.163472 -0.172143 -0.110876 -0.102766 0.065557 0.079111 0.171138 0.149024 0.107930 0.104667 0.099753 0.106285 0.088159 0.151025 0.131404 0.143648 0.209804 0.190953 0.133847 0.133775 0.131039 0.132324 0.208025
qa: -0.0606 -0.0485 -0.3803 -0.3379 -0.2808 0.1288 -0.2185 -0.1265 0.6218 0.1725 -0.1677 -0.0562 -0.2370 -0.2776 -0.0003 -0.1168 -0.1781 -0.1802 0.2463 0.1598 0.1416 0.2079 -0.1635 -0.1721 -0.1109 -0.1028 0.0656 0.0791 0.1711 0.1490 0.1079 0.1047 0.0998 0.1063 0.0882 0.1510 0.1314 0.1436 0.2098 0.1910 0.1338 0.1338 0.1310 0.1323 0.2080
va: 1.2657 1.2554 1.9565 2.0320 2.1359 3.4503 2.9159 3.5474 3.8355 3.8266 3.7116 3.9503 3.5566 3.9986 4.0154 3.9710 4.0885 3.9872 3.9220 3.9326 3.9236 3.8056 4.0085 4.0382 3.9794 3.9702 3.9826 0.9998 1.0109 1.0215 1.0024 0.9977 1.0105 1.0082 0.9978 1.0161 1.0242 1.0088 0.9891 0.9803 1.0038 1.0085 1.0095 1.0084 0.9921
dispersion: -0.025306488 hartree
energy: -2045.076872425585 hartree
dipole: -23.82184 15.37144 -8.45040 -9.98466 10.11403 0.12938 0.01750 -0.15675 -0.13925
magnitude: 8.45253 au
magnitude: 21.48463 debye
