program: Orca
programVersion: 5.0.2
elementType: Cl Cl O O O N N N C C C C C C C C C C C C C C C C C C C H H H H H H H H H H H H H H H H H H
charge: 1
multiplicity: 1
keywords: wb97x-d3
keywords: def2-TZVPP
keywords: def2/J RIJCOSX
keywords: DEFGRID2
keywords: scfconv7
keywords: smallprint printgap noloewdin
keywords: NOSOSCF
formula: C19H18Cl2N3O3
InChI: InChI=1/C19H18Cl2N3O3/c1-13-9-25-19(27-13,10-24-12-22-11-23-24)17-7-6-16(8-18(17)21)26-15-4-2-14(20)3-5-15/h2-8,11-13,22H,9-10H2,1H3
45 atoms
Cl -0.567083 1.41041 1.292846
Cl 7.210324 1.996621 1.367204
O  -3.257488 -1.480103 -0.875867
O  -2.985911 -0.271851 0.970452
O  3.032551 -1.535993 -0.711335
N  -4.224624 1.215186 -0.955847
N  -5.151782 0.930008 -1.879489
N  -6.06333 1.848403 -0.127805
C  -2.516257 -0.433664 -0.334471
C  -3.754453 -2.303122 0.183377
C  -2.832122 0.838112 -1.131762
C  -3.245802 -1.583787 1.435801
C  -1.021227 -0.697348 -0.39405
C  -3.289865 -3.735979 0.062056
C  -0.086829 0.07136 0.29659
C  -0.524959 -1.72246 -1.198803
C  1.274093 -0.173788 0.217803
C  0.824056 -1.988789 -1.297127
C  1.73325 -1.214212 -0.582385
C  -4.757144 1.759772 0.113427
C  -6.270812 1.323729 -1.368973
C  3.994792 -0.688769 -0.210005
C  4.636464 -1.016131 0.971606
C  4.335818 0.455936 -0.91237
C  5.634952 -0.186781 1.45891
C  5.32981 1.286665 -0.423986
C  5.973546 0.962783 0.761647
H  -4.848416 -2.26895 0.133882
H  -2.673187 0.666299 -2.193542
H  -2.207414 1.669775 -0.81185
H  -3.978937 -1.533342 2.239811
H  -2.331615 -2.045774 1.825045
H  -2.204848 -3.815103 0.133293
H  -3.608851 -4.177671 -0.880988
H  -3.722665 -4.334401 0.864733
H  -1.215888 -2.326972 -1.769212
H  1.960196 0.444001 0.780749
H  1.182998 -2.79185 -1.926216
H  -4.236697 2.078392 1.001593
H  -7.23316 1.255334 -1.848589
H  4.369586 -1.919551 1.503992
H  3.839391 0.693275 -1.844337
H  6.147006 -0.436181 2.377636
H  5.608807 2.178445 -0.967323
H  -6.756674 2.237854 0.495692
totalener: -2045.05169652 hartree
nucrepener: 2741.51090082 hartree
electener: -4786.56259734 hartree
oneelecener: -8230.86901549 hartree
twoeener: 3444.30641815 hartree
kineticenergy: 2039.08753523 hartree
xcener: -150.079939122042 hartree
chargesum: 1.0000000
charge: -0.062314 -0.048489 -0.349288 -0.368065 -0.279399 0.129606 -0.220470 -0.124769 0.591736 0.102911 -0.171385 0.003190 -0.171087 -0.271385 -0.039178 -0.124679 -0.140485 -0.204145 0.254381 0.161839 0.138980 0.197050 -0.165200 -0.156824 -0.109499 -0.114532 0.070103 0.075787 0.149504 0.171574 0.108038 0.099684 0.086266 0.106714 0.103627 0.157878 0.128252 0.141210 0.209776 0.191140 0.134426 0.135435 0.132568 0.131239 0.208282
qa: -0.0623 -0.0485 -0.3493 -0.3681 -0.2794 0.1296 -0.2205 -0.1248 0.5917 0.1029 -0.1714 0.0032 -0.1711 -0.2714 -0.0392 -0.1247 -0.1405 -0.2041 0.2544 0.1618 0.1390 0.1971 -0.1652 -0.1568 -0.1095 -0.1145 0.0701 0.0758 0.1495 0.1716 0.1080 0.0997 0.0863 0.1067 0.1036 0.1579 0.1283 0.1412 0.2098 0.1911 0.1344 0.1354 0.1326 0.1312 0.2083
va: 1.2706 1.2556 2.0227 1.9653 2.1415 3.4580 2.9152 3.5462 3.8608 3.9357 3.7235 3.8959 3.5131 3.9773 4.0934 3.9405 3.9384 4.0806 3.9099 3.9360 3.9218 3.8220 4.0262 4.0098 3.9740 3.9825 3.9793 0.9984 1.0222 1.0125 1.0009 1.0105 1.0025 1.0048 1.0091 1.0096 1.0276 1.0135 0.9886 0.9804 1.0078 1.0034 1.0085 1.0097 0.9919
dispersion: -0.025026088 hartree
energy: -2045.076722611301 hartree
dipole: -29.99400 21.89746 -8.09654 -18.16650 19.45355 1.28705 -4.90938 4.84925 -0.06013
magnitude: 8.19842 au
magnitude: 20.83873 debye
