program: Orca
programVersion: 5.0.2
elementType: Cl Cl O O O N N N C C C C C C C C C C C C C C C C C C C H H H H H H H H H H H H H H H H H H
charge: 1
multiplicity: 1
keywords: wb97x-d3
keywords: def2-TZVPP
keywords: def2/J RIJCOSX
keywords: DEFGRID2
keywords: scfconv7
keywords: smallprint printgap noloewdin
keywords: NOSOSCF
formula: C19H18Cl2N3O3
InChI: InChI=1/C19H18Cl2N3O3/c1-13-9-25-19(27-13,10-24-12-22-11-23-24)17-7-6-16(8-18(17)21)26-15-4-2-14(20)3-5-15/h2-8,11-13,22H,9-10H2,1H3
45 atoms
Cl -2.378567 0.382783 -2.204387
Cl 7.448427 -0.122809 1.735238
O  -3.48733 -1.446706 -0.230594
O  -2.495458 -1.899306 1.703729
O  2.409957 0.88937 -1.0650
N  -3.888868 1.229778 0.538157
N  -3.233935 2.393893 0.429957
N  -4.857688 2.283193 -1.015454
C  -2.668934 -0.902352 0.75443
C  -3.260916 -2.86213 -0.272306
C  -3.454348 0.206343 1.473048
C  -2.397177 -3.109993 0.975841
C  -1.327882 -0.408037 0.219221
C  -2.605086 -3.294947 -1.563526
C  -1.10748 0.156428 -1.037552
C  -0.21814 -0.498502 1.057731
C  0.145357 0.573463 -1.444814
C  1.045909 -0.084952 0.682369
C  1.233055 0.450471 -0.587156
C  -4.862352 1.139697 -0.338571
C  -3.828788 3.027875 -0.525007
C  3.57149 0.6290 -0.372836
C  4.106025 -0.649498 -0.361605
C  4.217481 1.675349 0.260706
C  5.301876 -0.88353 0.296233
C  5.419083 1.443228 0.911262
C  5.954732 0.164867 0.928937
H  -4.23836 -3.341914 -0.17245
H  -2.843627 0.700578 2.224862
H  -4.334324 -0.221728 1.95351
H  -2.76519 -3.919823 1.603808
H  -1.356798 -3.321069 0.705348
H  -3.218939 -3.042908 -2.426677
H  -2.469798 -4.377307 -1.562797
H  -1.625171 -2.834607 -1.692197
H  -0.341011 -0.921446 2.045842
H  0.29079 0.99238 -2.431146
H  1.869025 -0.185018 1.376027
H  -5.526726 0.30377 -0.478309
H  -3.563779 4.009888 -0.879115
H  3.602478 -1.45951 -0.87336
H  3.794863 2.670856 0.234339
H  5.73042 -1.875813 0.307008
H  5.936996 2.255783 1.400866
H  -5.481513 2.527507 -1.771251
totalener: -2045.04932438 hartree
nucrepener: 2798.99258325 hartree
electener: -4844.04190763 hartree
oneelecener: -8345.37971885 hartree
twoeener: 3501.33781121 hartree
kineticenergy: 2039.09955586 hartree
xcener: -150.083897793110 hartree
chargesum: 1.0000000
charge: -0.078723 -0.046319 -0.375097 -0.331701 -0.282661 0.105877 -0.228219 -0.112688 0.591089 0.127713 -0.086198 -0.030357 -0.113106 -0.273271 -0.081846 -0.184374 -0.129754 -0.150026 0.221372 0.153382 0.147727 0.215924 -0.168928 -0.174550 -0.107514 -0.101612 0.063830 0.089573 0.146731 0.141982 0.115976 0.097552 0.096388 0.109853 0.083508 0.146167 0.130325 0.145936 0.202946 0.185506 0.134583 0.131203 0.132179 0.131577 0.208048
qa: -0.0787 -0.0463 -0.3751 -0.3317 -0.2827 0.1059 -0.2282 -0.1127 0.5911 0.1277 -0.0862 -0.0304 -0.1131 -0.2733 -0.0818 -0.1844 -0.1298 -0.1500 0.2214 0.1534 0.1477 0.2159 -0.1689 -0.1745 -0.1075 -0.1016 0.0638 0.0896 0.1467 0.1420 0.1160 0.0976 0.0964 0.1099 0.0835 0.1462 0.1303 0.1459 0.2029 0.1855 0.1346 0.1312 0.1322 0.1316 0.2080
va: 1.2493 1.2576 1.9727 2.0283 2.1334 3.4486 2.8802 3.5433 3.8145 3.8889 3.7806 3.9418 3.5610 3.9708 3.9773 4.0509 4.0541 3.9555 3.9660 3.9749 3.9339 3.7915 4.0093 4.0423 3.9757 3.9715 3.9866 1.0020 1.0139 1.0146 0.9994 1.0007 1.0097 1.0104 0.9999 1.0223 1.0232 1.0065 0.9936 0.9838 1.0034 1.0091 1.0091 1.0087 0.9931
dispersion: -0.026556570 hartree
energy: -2045.075880949676 hartree
dipole: -22.48794 15.75931 -6.72863 -11.71009 13.06916 1.35907 0.17477 -0.83574 -0.66097
magnitude: 6.89627 au
magnitude: 17.52891 debye
