program: Gaussian 09
title: 000071107
version: EM64L-G09RevD.01
frameworkgroup: C1[X(C22H22N2O5S)]
method: RPBEPBE
basis: SDD
operation: Freq
keyword: #p
keyword: freq=noraman
keyword: PBEPBE/SDD
title: #p freq=noraman PBEPBE/SDD
converged: YES YES NO NO
title: Mulliken charges:
elementType: S O O O O O N N C C C C C C C C C C C C C C C C C C C C C C H H H H H H H H H H H H H H H H H H H H H H
charge: 0.186995 -0.167502 -0.415012 -0.194738 -0.221929 -0.273568 -0.108554 -0.365671 -0.462016 -0.143363 -0.088001 -0.170325 0.106707 -0.689889 -0.653607 0.153743 0.214624 -0.342900 0.490637 -0.460378 -0.359620 0.398376 -0.224370 -0.223570 -0.236224 -0.319350 -0.395408 -0.241336 -0.195497 -0.257351 0.316575 0.291594 0.314387 0.245378 0.237778 0.230602 0.253854 0.224350 0.241822 0.318028 0.224547 0.388595 0.226910 0.276642 0.227802 0.229176 0.230384 0.245765 0.251568 0.229122 0.226721 0.227497
chargesum: 0.00000
title: Mulliken charges with hydrogens summed into heavy atoms:
elementType: S O O O O O N N C C C C C C C C C C C C C C C C C C C C C C
charge: 0.186995 -0.167502 -0.026417 -0.194738 -0.221929 -0.273568 -0.108554 -0.047642 -0.145441 -0.143363 0.203593 0.144062 0.106707 0.023869 0.066419 0.153743 0.214624 -0.118353 0.490637 -0.233468 -0.082977 0.398376 0.003432 0.005606 -0.005840 -0.073584 -0.143840 -0.012214 0.031223 -0.029854
polarizability: 3.21561525e+02 1.08774282e+01 3.16845414e+02 3.10915945e+01 -4.83258460e+00 2.07560027e+02
1716.lowfreq: -4.8768 -0.0020 -0.0019 -0.0017 1.6952 7.7224 12.1867 15.5762 22.5390
frequency: 11.8681 15.4596 22.4994 26.3438 41.5561 46.8778 48.6110 50.8815 60.6221 61.4569 98.0058 103.9532 126.7982 133.1577 156.2274 181.4378 199.7557 207.7757 223.1218 232.4426 247.6320 258.0047 272.6577 286.8521 291.5794 294.6957 302.8709 340.8627 357.5893 365.1009 401.9999 410.4012 427.4223 463.4384 473.7822 494.7637 501.5638 520.2068 521.2041 528.0785 572.5084 583.6205 604.6329 612.5966 614.4710 619.6245 626.1650 647.7548 682.2558 691.3928 694.1729 701.9298 709.5677 722.7420 756.7026 762.7188 782.5804 804.7221 820.8020 829.2016 841.6258 853.4594 861.3824 890.3581 898.3839 909.5506 929.6272 939.1250 943.2013 962.3379 962.5729 977.9459 981.1524 984.0629 990.2682 992.3030 997.2250 1000.9590 1007.1018 1024.8400 1026.8685 1032.1682 1062.8085 1083.1239 1086.8540 1123.9080 1129.7136 1156.7499 1166.6385 1167.9368 1173.5527 1180.9477 1187.5380 1191.7246 1195.7584 1204.6707 1205.1905 1219.3711 1227.0955 1247.3592 1263.4238 1276.2161 1282.3617 1312.5005 1315.6357 1324.5656 1336.0716 1359.8660 1384.1662 1386.7343 1388.8810 1402.8078 1442.0781 1444.2608 1458.4060 1463.2346 1475.2187 1477.7825 1479.2797 1480.2753 1483.6536 1592.9374 1596.5364 1611.1062 1612.9269 1636.9872 1681.8650 1732.1326 2950.6849 2982.7550 2986.9556 3023.6955 3053.1456 3078.1391 3084.5942 3094.4551 3106.0875 3107.4960 3114.8587 3129.7054 3130.1509 3138.4967 3143.8362 3153.9732 3158.0286 3163.6149 3169.4577 3173.4035 3514.1561 3521.0002
redmass: 6.0597 5.7198 4.5795 5.6497 5.6309 5.6014 4.6209 6.0418 7.4323 6.4958 7.8169 7.9840 6.9889 7.3384 5.9400 5.2800 4.2156 5.1806 3.6386 2.2821 1.5357 3.8118 5.5181 2.9564 2.7892 1.6778 7.2756 3.9716 5.7032 3.5267 2.8106 2.9058 5.2201 4.6791 4.3774 5.7098 2.9582 4.3270 6.8483 4.4544 2.6907 2.7432 3.7043 4.7963 4.6270 2.3311 1.9513 4.1825 3.8262 2.4060 3.3461 2.0627 5.4287 3.2133 1.6645 4.1617 3.8872 4.4954 1.3376 3.9345 5.2684 1.2529 4.3104 1.5667 3.6394 3.3799 1.6775 2.0656 1.7378 1.5221 2.8276 1.4012 2.6365 1.7863 5.8720 4.1811 1.9601 2.2660 1.4873 2.1336 2.1752 2.9644 2.8137 1.5788 1.5566 1.8230 2.3584 1.6169 1.0975 2.0190 1.0575 1.2474 1.1589 1.8027 2.3033 2.1348 2.0276 1.4174 2.1118 1.7398 1.8847 2.7337 1.6652 1.5712 1.4105 1.4422 1.2859 1.5193 1.1943 8.7399 7.0507 1.1921 2.2202 2.2977 1.0496 1.0466 2.0451 1.0491 1.4247 1.3482 2.2071 6.3620 6.2305 6.4347 6.0717 7.3045 9.1145 12.7149 1.0838 1.0379 1.0361 1.0843 1.0840 1.0968 1.0989 1.1008 1.0935 1.0979 1.0881 1.0846 1.0869 1.0888 1.0921 1.0925 1.0963 1.0960 1.1004 1.1005 1.0642 1.0774
irintensity: 0.2843 0.2697 0.1225 0.9614 0.8333 0.4307 0.1344 0.4229 0.9662 1.4432 4.8962 3.6382 7.7356 1.0483 0.7125 3.9631 2.3733 5.4483 0.5747 1.3714 0.1004 0.1887 3.2759 0.9342 0.3157 0.4062 1.7980 0.0101 15.7956 12.9305 0.6517 0.1241 5.8938 3.1328 6.1410 11.9189 9.0518 56.2652 12.7835 5.7981 34.8320 39.1710 51.7522 8.5073 19.7562 3.3007 85.3598 5.4116 35.0422 29.8551 25.8155 44.3256 6.4910 71.3133 87.9695 8.1874 4.3596 28.5573 0.5307 3.3214 25.0281 0.0353 7.2813 8.3489 12.7072 23.6652 17.3352 0.1960 2.8144 3.3094 18.5724 0.1469 5.4995 5.4025 5.4312 17.4124 15.4468 18.0146 11.5567 37.3807 5.4499 164.7685 233.2259 14.9937 5.0484 89.7540 3.9098 11.8862 13.8195 12.7526 0.0538 65.1028 15.7438 73.5785 43.6694 118.9248 65.3772 12.5690 45.0050 7.7359 27.1556 195.8357 27.1386 2.4475 1.6581 34.8471 2.7962 23.1266 28.0705 5.0545 7.1226 16.7919 11.7022 1.8598 0.4826 7.6126 199.3821 15.9427 84.6794 138.1666 69.3665 32.5738 2.2164 57.4873 6.2791 137.0159 202.6161 371.1006 28.0388 17.8245 18.4964 5.1894 30.0277 10.8117 17.3160 14.4121 7.8728 16.6764 9.5353 2.5994 1.3534 8.4883 25.4757 37.7787 21.9648 17.9071 14.2136 8.5394 36.7181 27.5375
temp: 298.150 k
press: 1.00000 atm
elementType: 16 8 8 8 8 8 7 7 6 6 6 6 6 6 6 6 6 6 6 6 6 6 6 6 6 6 6 6 6 6 1 1 1 1 1 1 1 1 1 1 1 1 1 1 1 1 1 1 1 1 1 1
symmnumber: 1
zpe: 1048812.7 jmol-1
zpe.correction: 0.399472 hartree
zpe.thermalcorrener: 0.427679 hartree
zpe.thermalcorrenthalpy: 0.428623 hartree
zpe.thermalcorrgfe: 0.336129 hartree
zpe.sumelectzpe: -1733.043468 hartree
zpe.sumelectthermal: -1733.015260 hartree
zpe.sumelectthermalent: -1733.014316 hartree
zpe.sumelectthermalfe: -1733.106810 hartree
dipole: 5.2402 3.5620 3.4808
dipole: 7.2294
quadrupole: -157.6549 -177.7740 -186.4097
quadrupole: 2.2596 7.5697 -3.0972
quadrupole: 16.2913 -3.8277 -12.4635 2.2596 7.5697 -3.0972
hfenergy: -1733.4429392 hartree
pointgroup: C01 [X(C22H22N2O5S1)]
dipole: -2.2190884 -1.3317694 1.1797691 debye
polarizability: 324.7785675|13.3425691|311.1625849|-26.9647796|20.812897|210.0258147 unknown
InChI: InChI=1S/C22H22N2O5S/c1-22(2)17(21(27)28)24-19(26)15(20(24)30-22)23-18(25)16(13-9-5-3-6-10-13)29-14-11-7-4-8-12-14/h3-12,15-17,20,23,27H,1-2H3
charge 0 multiplicity 1
52 atoms
S  -2.735783 -1.286101 0.214924
O  -1.44213 2.803011 0.507482
O  -6.325494 2.139506 0.497898
O  -5.526416 2.054889 -1.687623
O  1.718277 0.235271 -1.963828
O  3.765374 -0.508895 -0.102202
N  -2.946931 1.24728 -0.60654
N  0.144249 0.044042 -0.252843
C  -2.314463 0.004466 -1.120328
C  -4.457492 -0.39796 0.479022
C  -4.165399 1.149444 0.195349
C  -0.909359 0.706052 -0.978706
C  -1.70801 1.833646 -0.220416
C  -4.901223 -0.616431 1.935832
C  -5.457977 -1.013098 -0.523403
C  -5.365554 1.822563 -0.476668
C  1.408419 -0.148923 -0.805581
C  2.382238 -0.925828 0.130142
C  2.306354 -2.415825 -0.165556
C  1.771474 -3.312157 0.789502
C  2.758067 -2.906556 -1.41637
C  4.153017 0.793231 0.287818
C  1.682685 -4.692644 0.498408
C  2.674682 -4.285573 -1.702376
C  2.134483 -5.181457 -0.748417
C  3.290422 1.758618 0.860859
C  5.522221 1.085582 0.079621
C  3.81489 3.02129 1.224531
C  6.028659 2.347484 0.447038
C  5.17894 3.323653 1.024018
H  -2.630031 -0.340426 -2.113332
H  -3.993117 1.663318 1.159675
H  -0.494724 1.037545 -1.946595
H  -5.842902 -0.067178 2.120702
H  -4.140799 -0.253603 2.648969
H  -5.084031 -1.686861 2.135148
H  -5.149452 -0.851693 -1.570404
H  -6.464544 -0.572985 -0.386925
H  -5.535379 -2.099197 -0.351322
H  -0.069446 -0.317855 0.680388
H  2.103078 -0.73538 1.189182
H  -7.109508 2.574461 0.064664
H  1.438142 -2.938814 1.766243
H  3.171567 -2.204156 -2.147264
H  1.27115 -5.382852 1.243048
H  3.028611 -4.663238 -2.668012
H  2.070171 -6.251792 -0.974194
H  2.224032 1.565349 1.011678
H  6.161042 0.318079 -0.367839
H  3.142992 3.769697 1.65915
H  7.088846 2.569932 0.282415
H  5.575081 4.304571 1.306541
