program: Orca
programVersion: 5.0.2
elementType: Cl Cl O O O N N N C C C C C C C C C C C C C C C C C C C H H H H H H H H H H H H H H H H H H
charge: 1
multiplicity: 1
keywords: wb97x-d3
keywords: def2-TZVPP
keywords: def2/J RIJCOSX
keywords: DEFGRID2
keywords: scfconv7
keywords: smallprint printgap noloewdin
keywords: NOSOSCF
formula: C19H18Cl2N3O3
InChI: InChI=1/C19H18Cl2N3O3/c1-13-9-25-19(27-13,10-24-12-22-11-23-24)17-7-6-16(8-18(17)21)26-15-4-2-14(20)3-5-15/h2-8,11-13,22H,9-10H2,1H3
45 atoms
Cl -1.992485 1.747764 2.260872
Cl 7.619636 -1.285947 -1.039854
O  -2.516962 -1.138508 -1.160522
O  -3.300839 -0.462018 0.80005
O  2.842814 1.134894 1.32174
N  -4.476252 0.912916 -1.246376
N  -5.453705 1.467054 -0.517404
N  -6.278896 0.116734 -2.011332
C  -2.471731 -0.076412 -0.242528
C  -2.800664 -2.346938 -0.437232
C  -3.078407 1.15457 -0.922014
C  -3.041703 -1.836244 0.989401
C  -1.04751 0.237592 0.184679
C  -1.690098 -3.364649 -0.551201
C  -0.748153 1.039131 1.291126
C  0.027466 -0.236512 -0.560116
C  0.554965 1.316744 1.652343
C  1.342544 0.029916 -0.222257
C  1.609079 0.806608 0.899747
C  -4.954564 0.087914 -2.148622
C  -6.550449 0.978692 -0.991931
C  3.940945 0.544092 0.739396
C  4.295378 -0.750369 1.083809
C  4.706357 1.27803 -0.149267
C  5.43036 -1.318514 0.529725
C  5.846032 0.712139 -0.699422
C  6.202037 -0.583506 -0.358965
H  -3.721968 -2.765189 -0.858103
H  -2.530754 1.386502 -1.834545
H  -3.0552 2.021732 -0.266568
H  -3.90272 -2.291004 1.477021
H  -2.161101 -1.989371 1.623738
H  -0.762582 -2.998663 -0.111144
H  -1.498976 -3.635329 -1.58884
H  -1.973674 -4.276436 -0.023455
H  -0.161181 -0.839061 -1.43757
H  0.764139 1.930967 2.517635
H  2.142211 -0.365178 -0.833056
H  -4.388867 -0.488005 -2.861442
H  -7.540938 1.215479 -0.640434
H  3.698194 -1.310231 1.792072
H  4.425067 2.292153 -0.400404
H  5.720113 -2.324997 0.797284
H  6.45673 1.280128 -1.387088
H  -6.945676 -0.39857 -2.568523
totalener: -2045.05052063 hartree
nucrepener: 2730.32875215 hartree
electener: -4775.37927278 hartree
oneelecener: -8208.59942933 hartree
twoeener: 3433.22015655 hartree
kineticenergy: 2039.08485650 hartree
xcener: -150.078532206589 hartree
chargesum: 1.0000000
charge: -0.035820 -0.049142 -0.401298 -0.319270 -0.280478 0.122467 -0.206305 -0.124394 0.586350 0.105904 -0.145621 0.004485 -0.168311 -0.269181 0.008489 -0.188903 -0.192448 -0.170807 0.253906 0.145496 0.142377 0.205515 -0.162329 -0.167047 -0.112635 -0.107151 0.068576 0.070929 0.157299 0.159147 0.110018 0.097734 0.090122 0.099726 0.108356 0.151115 0.131022 0.141398 0.211779 0.191033 0.134434 0.133179 0.130872 0.131517 0.207895
qa: -0.0358 -0.0491 -0.4013 -0.3193 -0.2805 0.1225 -0.2063 -0.1244 0.5863 0.1059 -0.1456 0.0045 -0.1683 -0.2692 0.0085 -0.1889 -0.1924 -0.1708 0.2539 0.1455 0.1424 0.2055 -0.1623 -0.1670 -0.1126 -0.1072 0.0686 0.0709 0.1573 0.1591 0.1100 0.0977 0.0901 0.0997 0.1084 0.1511 0.1310 0.1414 0.2118 0.1910 0.1344 0.1332 0.1309 0.1315 0.2079
va: 1.2937 1.2547 1.9485 2.0220 2.1372 3.4773 2.9116 3.5427 3.8771 3.8927 3.6982 3.9283 3.5302 3.9854 4.0749 3.9957 4.0875 3.9912 3.9135 3.9369 3.9270 3.8085 4.0098 4.0309 3.9774 3.9724 3.9762 0.9995 1.0018 1.0317 0.9995 1.0067 1.0019 1.0066 1.0075 1.0151 1.0257 1.0101 0.9864 0.9802 1.0039 1.0080 1.0094 1.0087 0.9921
dispersion: -0.024984368 hartree
energy: -2045.075504998422 hartree
dipole: -22.17763 14.27151 -7.90612 -13.40964 12.61061 -0.79903 -7.84673 4.82875 -3.01798
magnitude: 8.50020 au
magnitude: 21.60579 debye
