program: Orca
programVersion: 5.0.2
elementType: Cl Cl O O O N N N C C C C C C C C C C C C C C C C C C C H H H H H H H H H H H H H H H H H H
charge: 1
multiplicity: 1
keywords: wb97x-d3
keywords: def2-TZVPP
keywords: def2/J RIJCOSX
keywords: DEFGRID2
keywords: scfconv7
keywords: smallprint printgap noloewdin
keywords: NOSOSCF
formula: C19H18Cl2N3O3
InChI: InChI=1/C19H18Cl2N3O3/c1-13-9-25-19(27-13,10-24-12-22-11-23-24)17-7-6-16(8-18(17)21)26-15-4-2-14(20)3-5-15/h2-8,11-13,22H,9-10H2,1H3
45 atoms
Cl -1.304918 0.849112 1.373501
Cl 6.535531 1.629992 2.202385
O  -3.312325 -2.425408 -1.006459
O  -3.371738 -1.106472 0.779683
O  2.5848 -0.463939 -1.571728
N  -3.671835 1.178257 -0.828557
N  -2.848586 2.059018 -1.413151
N  -3.739471 2.907047 0.383357
C  -2.960757 -1.162889 -0.546713
C  -3.330375 -3.327344 0.107313
C  -3.821333 -0.171868 -1.344958
C  -3.10453 -2.39523 1.307054
C  -1.466783 -0.910355 -0.73775
C  -2.290152 -4.415013 -0.026993
C  -0.672638 -0.071367 0.037151
C  -0.831352 -1.554546 -1.803041
C  0.684079 0.096268 -0.199828
C  0.510362 -1.401115 -2.069986
C  1.282443 -0.57666 -1.256712
C  -4.205842 1.668427 0.26641
C  -2.892043 3.109616 -0.663149
C  3.476368 0.040065 -0.654183
C  3.762984 -0.664422 0.505167
C  4.124048 1.228698 -0.940497
C  4.705348 -0.16955 1.390019
C  5.074129 1.720127 -0.058374
C  5.357307 1.021585 1.104647
H  -4.329123 -3.771348 0.140783
H  -4.871202 -0.456404 -1.273502
H  -3.52987 -0.149217 -2.392348
H  -3.78568 -2.580914 2.136006
H  -2.075215 -2.456813 1.6779
H  -2.450005 -5.004506 -0.928579
H  -2.353673 -5.096516 0.822558
H  -1.280386 -4.004865 -0.056071
H  -1.40666 -2.219152 -2.432815
H  1.260269 0.749762 0.440779
H  0.971521 -1.923291 -2.897185
H  -4.883346 1.163149 0.934114
H  -2.349597 4.023036 -0.839995
H  3.268022 -1.604242 0.713784
H  3.903152 1.760554 -1.856378
H  4.941926 -0.715369 2.292541
H  5.593448 2.642318 -0.278656
H  -3.953412 3.553627 1.129294
totalener: -2045.04895280 hartree
nucrepener: 2819.63859997 hartree
electener: -4864.68755277 hartree
oneelecener: -8386.51321421 hartree
twoeener: 3521.82566144 hartree
kineticenergy: 2039.10147923 hartree
xcener: -150.084034320700 hartree
chargesum: 1.0000000
charge: -0.075271 -0.047635 -0.347136 -0.362720 -0.277613 0.106337 -0.226269 -0.111967 0.589645 0.138129 -0.095556 -0.039299 -0.092198 -0.273928 -0.095451 -0.192292 -0.093335 -0.174489 0.223963 0.153988 0.146475 0.213013 -0.165623 -0.188210 -0.106307 -0.098555 0.059622 0.091245 0.141499 0.147078 0.113286 0.100059 0.105025 0.104304 0.080397 0.144800 0.127720 0.143547 0.204029 0.185423 0.136911 0.135058 0.132087 0.132310 0.207902
qa: -0.0753 -0.0476 -0.3471 -0.3627 -0.2776 0.1063 -0.2263 -0.1120 0.5896 0.1381 -0.0956 -0.0393 -0.0922 -0.2739 -0.0955 -0.1923 -0.0933 -0.1745 0.2240 0.1540 0.1465 0.2130 -0.1656 -0.1882 -0.1063 -0.0986 0.0596 0.0912 0.1415 0.1471 0.1133 0.1001 0.1050 0.1043 0.0804 0.1448 0.1277 0.1435 0.2040 0.1854 0.1369 0.1351 0.1321 0.1323 0.2079
va: 1.2633 1.2565 2.0144 1.9872 2.1391 3.4489 2.8788 3.5440 3.8035 3.8882 3.8005 3.9385 3.5036 3.9769 4.0354 4.0077 3.8861 4.0400 3.9416 3.9719 3.9342 3.8013 3.9996 4.0411 3.9760 3.9652 3.9885 1.0004 1.0143 1.0133 1.0016 1.0052 1.0071 1.0096 0.9998 1.0208 1.0260 1.0106 0.9916 0.9840 1.0020 1.0090 1.0092 1.0082 0.9932
dispersion: -0.026468384 hartree
energy: -2045.075421186414 hartree
dipole: -23.37969 17.54687 -5.83282 -18.39539 20.28089 1.88550 -7.41658 7.63865 0.22207
magnitude: 6.13403 au
magnitude: 15.59145 debye
