program: Orca
programVersion: 5.0.2
elementType: Cl Cl O O O N N N C C C C C C C C C C C C C C C C C C C H H H H H H H H H H H H H H H H H H
charge: 1
multiplicity: 1
keywords: wb97x-d3
keywords: def2-TZVPP
keywords: def2/J RIJCOSX
keywords: DEFGRID2
keywords: scfconv7
keywords: smallprint printgap noloewdin
keywords: NOSOSCF
formula: C19H18Cl2N3O3
InChI: InChI=1/C19H18Cl2N3O3/c1-13-9-25-19(27-13,10-24-12-22-11-23-24)17-7-6-16(8-18(17)21)26-15-4-2-14(20)3-5-15/h2-8,11-13,22H,9-10H2,1H3
45 atoms
Cl -1.961058 -1.698991 -2.823261
Cl 6.561954 2.381176 1.899353
O  -3.579459 -2.071011 -0.343753
O  -3.270935 -0.697824 1.37816
O  2.576049 -0.770658 -1.010631
N  -3.405613 1.559008 -0.251888
N  -2.377341 2.213963 -0.815171
N  -3.201206 3.346118 0.848634
C  -3.019886 -0.84975 0.01482
C  -3.505566 -2.948491 0.782243
C  -3.805798 0.24718 -0.716348
C  -3.242897 -1.994162 1.959231
C  -1.521719 -0.796994 -0.276628
C  -2.439199 -4.006908 0.610951
C  -0.969791 -1.171222 -1.502096
C  -0.63339 -0.364267 0.701851
C  0.393348 -1.136162 -1.733644
C  0.737146 -0.327017 0.503948
C  1.250567 -0.721738 -0.722916
C  -3.909276 2.229865 0.75947
C  -2.266695 3.307334 -0.133532
C  3.466526 -0.013303 -0.294522
C  4.526504 -0.661174 0.317932
C  3.351134 1.368878 -0.237805
C  5.488134 0.077282 0.991095
C  4.30425 2.106998 0.444233
C  5.366954 1.455908 1.053665
H  -4.483964 -3.425391 0.873552
H  -4.869268 0.126649 -0.513147
H  -3.654122 0.216094 -1.792205
H  -4.016486 -2.04237 2.726201
H  -2.274931 -2.190845 2.432018
H  -2.44251 -4.67445 1.474266
H  -1.442169 -3.57187 0.528176
H  -2.626736 -4.614952 -0.274463
H  -1.013662 -0.054067 1.665343
H  0.797419 -1.436361 -2.691841
H  1.381564 -0.003681 1.310377
H  -4.738662 1.936142 1.38222
H  -1.544305 4.086182 -0.310477
H  4.611035 -1.739119 0.264707
H  2.528384 1.876427 -0.72582
H  6.319429 -0.427294 1.464776
H  4.217944 3.184298 0.489232
H  -3.34898 4.089935 1.522495
elementType: Cl O N C H
totalener: -2045.14814860 hartree
nucrepener: 2786.02656549 hartree
electener: -4831.17471409 hartree
oneelecener: -8319.82876890 hartree
twoeener: 3488.65405481 hartree
cpcmener: -0.10740803 hartree
kineticenergy: 2039.02833894 hartree
xcener: -150.070860255645 hartree
chargesum: 1.0000000
charge: -0.072722 -0.093593 -0.370355 -0.399984 -0.317607 0.127588 -0.296934 -0.094831 0.625358 0.214961 -0.077792 -0.061518 -0.281299 -0.304277 0.059960 -0.110953 -0.221522 -0.213336 0.290719 0.191118 0.159551 0.266450 -0.228118 -0.191088 -0.113196 -0.127702 0.071199 0.091713 0.137641 0.148774 0.110840 0.100971 0.104873 0.085420 0.094004 0.148831 0.127341 0.156222 0.218014 0.200087 0.150179 0.159049 0.145880 0.145155 0.244930
qa: -0.0727 -0.0936 -0.3704 -0.4000 -0.3176 0.1276 -0.2969 -0.0948 0.6254 0.2150 -0.0778 -0.0615 -0.2813 -0.3043 0.0600 -0.1110 -0.2215 -0.2133 0.2907 0.1911 0.1596 0.2664 -0.2281 -0.1911 -0.1132 -0.1277 0.0712 0.0917 0.1376 0.1488 0.1108 0.1010 0.1049 0.0854 0.0940 0.1488 0.1273 0.1562 0.2180 0.2001 0.1502 0.1590 0.1459 0.1452 0.2449
va: 1.2499 1.2090 2.0086 1.9691 2.0929 3.4393 2.8913 3.5657 3.8171 3.8282 3.7802 3.9697 3.5758 3.9778 3.9471 3.8561 4.1364 3.9842 3.7922 3.9226 3.9302 3.7106 4.0417 3.9753 3.9504 3.9593 3.8536 0.9992 1.0208 1.0233 1.0007 0.9939 1.0083 0.9960 1.0085 1.0192 1.0280 0.9992 0.9746 0.9772 1.0041 0.9954 1.0022 1.0036 0.9667
dispersion: -0.025839266 hartree
energy: -2045.173987866694 hartree
dipole: -21.68807 15.17907 -6.50900 -9.34219 13.34206 3.99987 10.29046 -7.64228 2.64819
magnitude: 8.08573 au
magnitude: 20.55229 debye
