program: Orca
programVersion: 5.0.2
elementType: Cl Cl O O O N N N C C C C C C C C C C C C C C C C C C C H H H H H H H H H H H H H H H H H H
charge: 1
multiplicity: 1
keywords: wb97x-d3
keywords: def2-TZVPP
keywords: def2/J RIJCOSX
keywords: DEFGRID2
keywords: scfconv7
keywords: smallprint printgap noloewdin
keywords: NOSOSCF
formula: C19H18Cl2N3O3
InChI: InChI=1/C19H18Cl2N3O3/c1-13-9-25-19(27-13,10-24-12-22-11-23-24)17-7-6-16(8-18(17)21)26-15-4-2-14(20)3-5-15/h2-8,11-13,22H,9-10H2,1H3
45 atoms
Cl -0.347804 -1.749538 -1.732014
Cl 7.096723 0.767022 -1.208258
O  -2.898596 -2.407851 -0.384893
O  -3.822758 -0.897517 1.004351
O  2.082308 0.93593 1.808926
N  -3.447172 1.138141 -1.024923
N  -4.508258 1.703007 -0.425666
N  -2.924915 3.162089 -0.733152
C  -2.911208 -1.055352 -0.04056
C  -3.641197 -3.145151 0.589299
C  -3.405948 -0.285778 -1.286238
C  -4.599413 -2.083168 1.098936
C  -1.548805 -0.551846 0.417074
C  -2.73906 -3.734405 1.653808
C  -0.367605 -0.813682 -0.271807
C  -1.444433 0.244873 1.557746
C  0.863229 -0.338163 0.157482
C  -0.236232 0.74649 1.998833
C  0.92606 0.446883 1.299408
C  -2.479385 2.008813 -1.209881
C  -4.176171 2.941591 -0.258185
C  3.238052 0.885112 1.069501
C  3.376827 1.648072 -0.080833
C  4.277938 0.094675 1.528425
C  4.568622 1.61053 -0.785968
C  5.476075 0.064614 0.830588
C  5.608521 0.816316 -0.325619
H  -4.167701 -3.94034 0.058736
H  -4.413347 -0.603817 -1.553014
H  -2.755608 -0.451605 -2.142491
H  -5.500302 -2.01484 0.480237
H  -4.897937 -2.220522 2.138171
H  -3.322487 -4.363469 2.327396
H  -2.250432 -2.964663 2.25396
H  -1.96668 -4.360309 1.2056
H  -2.333148 0.485967 2.123624
H  1.753697 -0.593084 -0.401121
H  -0.191592 1.361562 2.888332
H  -1.520351 1.820909 -1.666033
H  -4.794365 3.702874 0.187457
H  2.563817 2.271993 -0.43065
H  4.161075 -0.491388 2.430963
H  4.681117 2.200755 -1.685273
H  6.29307 -0.54716 1.188604
H  -2.418971 4.041169 -0.736712
elementType: Cl O N C H
totalener: -2045.14761839 hartree
nucrepener: 2792.36217314 hartree
electener: -4837.50979152 hartree
oneelecener: -8331.45666450 hartree
twoeener: 3493.94687297 hartree
cpcmener: -0.10764741 hartree
kineticenergy: 2039.02881487 hartree
xcener: -150.069856531076 hartree
chargesum: 1.0000000
charge: -0.068953 -0.091143 -0.376916 -0.382475 -0.314274 0.136326 -0.283456 -0.087740 0.514780 0.190323 -0.140794 -0.000438 -0.160806 -0.302645 0.016662 -0.101294 -0.162037 -0.257753 0.317941 0.170779 0.151581 0.251976 -0.192050 -0.208712 -0.128258 -0.119832 0.077660 0.094179 0.136747 0.152141 0.093826 0.103555 0.098672 0.092992 0.093854 0.145703 0.127268 0.148219 0.219415 0.200439 0.157754 0.151101 0.145437 0.146064 0.244183
qa: -0.0690 -0.0911 -0.3769 -0.3825 -0.3143 0.1363 -0.2835 -0.0877 0.5148 0.1903 -0.1408 -0.0004 -0.1608 -0.3026 0.0167 -0.1013 -0.1620 -0.2578 0.3179 0.1708 0.1516 0.2520 -0.1921 -0.2087 -0.1283 -0.1198 0.0777 0.0942 0.1367 0.1521 0.0938 0.1036 0.0987 0.0930 0.0939 0.1457 0.1273 0.1482 0.2194 0.2004 0.1578 0.1511 0.1454 0.1461 0.2442
va: 1.2556 1.2118 2.0113 1.9775 2.1030 3.4380 2.9162 3.5612 3.9938 3.8836 3.8682 3.9884 3.4953 3.9613 3.9992 3.8434 3.9648 4.0701 3.7688 3.9256 3.9423 3.7191 3.9836 4.0357 3.9611 3.9533 3.8541 0.9975 1.0156 1.0138 0.9996 0.9928 1.0090 0.9986 1.0097 1.0260 1.0312 1.0077 0.9674 0.9776 0.9956 1.0027 1.0036 1.0026 0.9670
dispersion: -0.026093217 hartree
energy: -2045.173711604815 hartree
dipole: -28.99324 23.42287 -5.57037 -4.88897 8.85220 3.96323 11.81678 -12.68471 -0.86793
magnitude: 6.89127 au
magnitude: 17.51621 debye
