program: Gaussian 09
title: 000071100
version: EM64L-G09RevD.01
frameworkgroup: C1[X(C14H13NO)]
method: RPBEPBE
basis: SDD
operation: Freq
keyword: #p
keyword: freq=noraman
keyword: PBEPBE/SDD
title: #p freq=noraman PBEPBE/SDD
converged: YES YES NO NO
title: Mulliken charges:
elementType: O N C C C C C C C C C C C C C C H H H H H H H H H H H H H
charge: -0.262525 -0.482978 0.327306 0.270224 -0.343717 0.242336 -0.384432 0.134941 -0.848029 -0.234060 -0.249227 -0.343513 -0.358563 -0.223084 -0.237009 -0.227680 0.336549 0.309381 0.227418 0.230849 0.225922 0.246745 0.227757 0.226914 0.274837 0.215727 0.233727 0.230395 0.233787
chargesum: 0.00000
title: Mulliken charges with hydrogens summed into heavy atoms:
elementType: O N C C C C C C C C C C C C C C
charge: -0.262525 -0.146429 0.327306 0.270224 -0.034336 0.242336 -0.157015 0.134941 -0.144513 -0.006303 -0.022313 -0.068675 -0.142836 0.010643 -0.006614 0.006107
polarizability: 2.65507063e+02 -3.87040184e+00 1.65449056e+02 -5.28664748e+00 -5.17587371e+00 7.24859178e+01
1716.lowfreq: -4.4955 -1.8776 -0.0009 -0.0007 -0.0006 3.6244 29.6259 42.3899 70.9106
frequency: 29.5946 42.3761 70.9067 91.1538 149.7814 183.9451 192.2930 216.4052 238.5457 297.3295 313.7201 401.9292 408.4110 422.9241 445.5670 471.5628 531.1511 540.7569 586.8521 613.7548 635.8549 668.4906 686.1609 703.1270 729.8280 761.5131 769.2830 789.9471 832.0922 854.0428 869.0592 882.5631 933.7726 955.2435 979.3675 983.2974 989.2412 998.4845 1005.5433 1024.1595 1042.3240 1046.6243 1076.3212 1088.6006 1122.3178 1173.6972 1174.0664 1190.8671 1197.2291 1243.3572 1270.8131 1297.1698 1318.7280 1375.7472 1384.4369 1395.6453 1432.2467 1439.9156 1452.7269 1479.1573 1482.0269 1487.5162 1516.8730 1576.6566 1595.7377 1609.2939 1612.0484 1618.8291 2952.3279 3020.5823 3087.0638 3112.4561 3121.9100 3132.6453 3137.9610 3145.5082 3159.2315 3161.1425 3170.8299 3194.7536 3544.8945
redmass: 3.8252 5.1525 4.6801 5.1092 3.8610 3.6098 1.1190 4.1636 4.4595 3.6826 6.4719 2.9317 3.9759 3.7820 3.0226 4.6979 5.1473 2.9704 6.2544 5.9891 1.2922 5.9992 5.1415 1.5243 2.7772 4.9640 1.3631 2.4648 4.2461 1.3161 5.7410 1.3029 1.4491 1.3689 1.5701 1.4348 5.2186 1.3074 1.3451 2.5203 1.5274 2.1245 2.4706 1.8278 1.8521 1.0888 1.0586 1.1370 1.9209 3.4719 2.0773 1.6578 1.3506 5.8438 8.8864 1.2745 2.2397 2.3179 1.8875 1.9554 1.0581 1.5349 2.0687 6.1510 6.0221 5.9253 4.7795 6.0197 1.0401 1.0978 1.0946 1.0880 1.0872 1.0867 1.0901 1.0919 1.0956 1.0985 1.1005 1.0949 1.0752
irintensity: 0.1490 1.3684 1.6266 2.9394 0.2473 2.4927 1.1917 3.2478 0.2822 4.1036 7.7921 0.4564 1.4982 0.3311 8.1933 5.5125 4.3494 10.1223 11.9536 1.5410 39.1118 11.4508 9.4617 95.2693 2.0763 2.4920 104.5208 14.7530 0.6883 0.8347 13.7674 3.3920 2.6021 4.0823 3.8392 2.0681 0.4559 2.4730 1.8021 10.6097 6.9952 17.3073 10.9942 11.4197 6.2655 0.0733 1.3182 9.1927 8.0965 67.3108 36.6665 60.5422 4.8920 94.9427 2.1497 21.7799 7.7673 73.4310 128.7943 11.1677 16.1744 61.0526 325.7452 59.7254 56.3049 13.6273 48.0311 1.1388 32.0322 23.3855 19.8469 14.6134 9.2524 0.8016 18.9035 21.5170 16.8724 32.4210 21.7185 10.0414 16.7936
temp: 298.150 k
press: 1.00000 atm
elementType: 8 7 6 6 6 6 6 6 6 6 6 6 6 6 6 6 1 1 1 1 1 1 1 1 1 1 1 1 1
symmnumber: 1
zpe: 609750.4 jmol-1
zpe.correction: 0.232242 hartree
zpe.thermalcorrener: 0.245905 hartree
zpe.thermalcorrenthalpy: 0.246849 hartree
zpe.thermalcorrgfe: 0.190730 hartree
zpe.sumelectzpe: -670.167299 hartree
zpe.sumelectthermal: -670.153636 hartree
zpe.sumelectthermalent: -670.152692 hartree
zpe.sumelectthermalfe: -670.208811 hartree
dipole: -1.0465 4.0698 0.3951
dipole: 4.2207
quadrupole: -76.5964 -89.3501 -99.1979
quadrupole: -0.5896 -1.1234 -1.9124
quadrupole: 11.7851 -0.9686 -10.8164 -0.5896 -1.1234 -1.9124
hfenergy: -670.3995412 hartree
pointgroup: C01 [X(C14H13N1O1)]
dipole: -0.3980646 -1.6068487 -0.1303993 debye
polarizability: 265.4053704|4.8048568|165.3283157|5.7856839|-6.6312562|72.7083508 unknown
InChI: InChI=1S/C14H13NO/c1-11-7-5-6-10-13(11)15-14(16)12-8-3-2-4-9-12/h2-10,15H,1H3
charge 0 multiplicity 1
29 atoms
O  -0.44562 2.065586 0.056835
N  0.374705 -0.136845 -0.065041
C  1.785461 0.058411 -0.024579
C  2.612366 -1.105866 -0.139113
C  2.370283 1.344017 0.127689
C  -2.045334 0.242172 0.011234
C  4.014719 -0.939192 -0.093119
C  -0.64716 0.812287 0.010461
C  2.007076 -2.491172 -0.302807
C  3.774066 1.472596 0.171164
C  4.604706 0.336016 0.061263
C  -3.094125 1.09567 -0.417938
C  -2.359394 -1.070881 0.453518
C  -4.427323 0.638051 -0.433521
C  -3.696106 -1.526896 0.442396
C  -4.732336 -0.676853 -0.007908
H  0.071742 -1.101649 -0.206334
H  1.718247 2.215519 0.204137
H  4.653461 -1.826435 -0.179317
H  1.388995 -2.575236 -1.219795
H  1.372172 -2.776221 0.561145
H  2.799703 -3.253125 -0.381465
H  4.215544 2.468256 0.289722
H  5.694712 0.437246 0.093576
H  -2.836175 2.114274 -0.725165
H  -1.580719 -1.732487 0.854017
H  -5.22847 1.303399 -0.773054
H  -3.930271 -2.536805 0.796396
H  -5.768723 -1.031936 -0.015892
