program: Orca
programVersion: 5.0.2
elementType: Cl Cl O O O N N N C C C C C C C C C C C C C C C C C C C H H H H H H H H H H H H H H H H H H
charge: 1
multiplicity: 1
keywords: wb97x-d3
keywords: def2-TZVPP
keywords: def2/J RIJCOSX
keywords: DEFGRID2
keywords: scfconv7
keywords: smallprint printgap noloewdin
keywords: NOSOSCF
formula: C19H18Cl2N3O3
InChI: InChI=1/C19H18Cl2N3O3/c1-13-9-25-19(27-13,10-24-12-22-11-23-24)17-7-6-16(8-18(17)21)26-15-4-2-14(20)3-5-15/h2-8,11-13,22H,9-10H2,1H3
45 atoms
Cl -1.895861 -1.177633 3.207649
Cl 6.638419 1.969345 -2.258745
O  -3.157913 -1.115734 -1.141646
O  -3.426145 -2.169777 0.832789
O  2.620681 -0.374873 1.30055
N  -3.320452 1.406757 0.027962
N  -2.294883 2.158586 0.469957
N  -2.995216 2.859774 -1.468784
C  -2.928147 -1.006914 0.236086
C  -3.716135 -2.402151 -1.432431
C  -3.7351 0.212598 0.733062
C  -4.320617 -2.776798 -0.091505
C  -1.443537 -0.85884 0.526256
C  -2.660958 -3.367707 -1.927512
C  -0.903881 -0.905439 1.811532
C  -0.553769 -0.624327 -0.516573
C  0.447408 -0.729034 2.046962
C  0.805357 -0.45056 -0.313636
C  1.304327 -0.499767 0.979142
C  -3.744513 1.815201 -1.146551
C  -2.113085 3.043566 -0.455859
C  3.513952 0.184601 0.419716
C  3.314415 1.448518 -0.118313
C  4.66907 -0.528624 0.144376
C  4.277949 1.996024 -0.949901
C  5.640985 0.024278 -0.675387
C  5.433907 1.280047 -1.222186
H  -4.485146 -2.259128 -2.19267
H  -3.603959 0.39382 1.796155
H  -4.796507 0.058564 0.540437
H  -5.335238 -2.382351 0.022618
H  -4.337209 -3.849764 0.096497
H  -2.147485 -2.970179 -2.803199
H  -3.131306 -4.307091 -2.219697
H  -1.915776 -3.588478 -1.161673
H  -0.922382 -0.575438 -1.530527
H  0.841006 -0.7730 3.053969
H  1.448889 -0.285872 -1.166744
H  -4.554597 1.402483 -1.724879
H  -1.374371 3.827049 -0.437506
H  2.419236 2.014633 0.105839
H  4.818301 -1.510667 0.57384
H  4.125376 2.979796 -1.371934
H  6.545043 -0.530132 -0.886655
H  -3.080534 3.414993 -2.313273
elementType: Cl O N C H
totalener: -2045.14194976 hartree
nucrepener: 2780.74582617 hartree
electener: -4825.88777593 hartree
oneelecener: -8309.23498871 hartree
twoeener: 3483.34721278 hartree
cpcmener: -0.12479389 hartree
kineticenergy: 2039.01380632 hartree
xcener: -150.068158528844 hartree
chargesum: 1.0000000
charge: -0.077468 -0.098038 -0.437515 -0.382279 -0.325543 0.132532 -0.302790 -0.088526 0.666521 0.172924 -0.143387 0.010065 -0.175125 -0.306787 0.012319 -0.111853 -0.236119 -0.230102 0.321338 0.190371 0.157433 0.303005 -0.217936 -0.246120 -0.121713 -0.111333 0.066141 0.090115 0.142291 0.145224 0.094860 0.105287 0.094662 0.104273 0.094028 0.147877 0.128362 0.156481 0.218854 0.198655 0.163611 0.150889 0.147727 0.148283 0.248508
qa: -0.0775 -0.0980 -0.4375 -0.3823 -0.3255 0.1325 -0.3028 -0.0885 0.6665 0.1729 -0.1434 0.0101 -0.1751 -0.3068 0.0123 -0.1119 -0.2361 -0.2301 0.3213 0.1904 0.1574 0.3030 -0.2179 -0.2461 -0.1217 -0.1113 0.0661 0.0901 0.1423 0.1452 0.0949 0.1053 0.0947 0.1043 0.0940 0.1479 0.1284 0.1565 0.2189 0.1987 0.1636 0.1509 0.1477 0.1483 0.2485
va: 1.2459 1.2047 1.9573 1.9897 2.0879 3.4308 2.8932 3.5658 3.7165 3.9183 3.9067 3.9892 3.5647 3.9508 4.0064 3.8308 4.1414 4.0031 3.7735 3.9242 3.9364 3.6615 3.9804 4.0524 3.9512 3.9437 3.8433 1.0008 1.0256 0.9997 0.9981 0.9928 1.0065 1.0081 1.0012 1.0260 1.0277 0.9993 0.9740 0.9786 0.9937 1.0045 1.0025 1.0012 0.9643
dispersion: -0.025580095 hartree
energy: -2045.167529857218 hartree
dipole: -24.89232 17.72059 -7.17173 -9.49396 12.78649 3.29253 -12.19135 8.57569 -3.61566
magnitude: 8.68029 au
magnitude: 22.06355 debye
