program: Orca
programVersion: 5.0.2
elementType: Cl Cl O O O N N N C C C C C C C C C C C C C C C C C C C H H H H H H H H H H H H H H H H H H
charge: 1
multiplicity: 1
keywords: wb97x-d3
keywords: def2-TZVPP
keywords: def2/J RIJCOSX
keywords: DEFGRID2
keywords: scfconv7
keywords: smallprint printgap noloewdin
keywords: NOSOSCF
formula: C19H18Cl2N3O3
InChI: InChI=1/C19H18Cl2N3O3/c1-13-9-25-19(27-13,10-24-12-22-11-23-24)17-7-6-16(8-18(17)21)26-15-4-2-14(20)3-5-15/h2-8,11-13,22H,9-10H2,1H3
45 atoms
Cl -0.705289 -0.6793 -2.311159
Cl 6.897891 1.439933 -1.864489
O  -3.076125 -1.905337 -1.081149
O  -3.651149 -1.343885 1.025053
O  2.442353 -0.091403 1.617004
N  -3.486337 1.426429 0.347699
N  -4.494719 1.583898 1.225491
N  -2.843417 2.925328 1.690363
C  -2.919339 -0.928042 -0.090811
C  -3.757129 -3.032399 -0.520146
C  -3.518729 0.379981 -0.652891
C  -4.527888 -2.384123 0.614708
C  -1.466907 -0.731038 0.317533
C  -2.786174 -4.106776 -0.077675
C  -0.428071 -0.605234 -0.600894
C  -1.12882 -0.603415 1.665094
C  0.886949 -0.396533 -0.211104
C  0.167898 -0.374659 2.08178
C  1.182261 -0.277383 1.13864
C  -2.478545 2.223476 0.627061
C  -4.086913 2.508074 2.033529
C  3.457721 0.271684 0.761246
C  3.438612 1.499979 0.116488
C  4.524635 -0.596949 0.606857
C  4.499259 1.858592 -0.699427
C  5.593449 -0.234651 -0.199358
C  5.568832 0.988204 -0.849827
H  -4.4266 -3.421504 -1.288553
H  -4.558466 0.229445 -0.939356
H  -2.970254 0.729222 -1.52543
H  -5.488026 -1.979993 0.279318
H  -4.700255 -3.046694 1.462244
H  -3.336654 -4.985682 0.259242
H  -2.150281 -3.773349 0.74434
H  -2.144763 -4.415365 -0.903416
H  -1.898383 -0.677157 2.420036
H  1.65884 -0.334021 -0.96601
H  0.392583 -0.277005 3.135608
H  -1.550001 2.309908 0.085779
H  -4.645308 2.905488 2.863962
H  2.605097 2.178939 0.244353
H  4.530403 -1.550763 1.117976
H  4.48748 2.812859 -1.207987
H  6.430801 -0.90838 -0.318324
H  -2.290677 3.641335 2.149461
elementType: Cl O N C H
totalener: -2045.14143476 hartree
nucrepener: 2788.03551714 hartree
electener: -4833.17695190 hartree
oneelecener: -8322.75195680 hartree
twoeener: 3489.57500489 hartree
cpcmener: -0.12187837 hartree
kineticenergy: 2039.00278046 hartree
xcener: -150.065572267574 hartree
chargesum: 1.0000000
charge: -0.073572 -0.096537 -0.392022 -0.395726 -0.324864 0.140892 -0.295687 -0.084222 0.527307 0.193320 -0.141840 0.001723 -0.167621 -0.305204 0.039918 -0.100402 -0.173480 -0.254986 0.322418 0.166732 0.154856 0.262948 -0.195096 -0.217399 -0.129880 -0.123185 0.079673 0.095174 0.137620 0.156805 0.096368 0.105278 0.099302 0.093736 0.092395 0.146765 0.126667 0.149432 0.222310 0.200846 0.164353 0.151880 0.146986 0.147429 0.248591
qa: -0.0736 -0.0965 -0.3920 -0.3957 -0.3249 0.1409 -0.2957 -0.0842 0.5273 0.1933 -0.1418 0.0017 -0.1676 -0.3052 0.0399 -0.1004 -0.1735 -0.2550 0.3224 0.1667 0.1549 0.2629 -0.1951 -0.2174 -0.1299 -0.1232 0.0797 0.0952 0.1376 0.1568 0.0964 0.1053 0.0993 0.0937 0.0924 0.1468 0.1267 0.1494 0.2223 0.2008 0.1644 0.1519 0.1470 0.1474 0.2486
va: 1.2514 1.2062 1.9946 1.9666 2.0890 3.4338 2.9130 3.5606 3.9818 3.8809 3.8637 3.9848 3.5201 3.9618 3.9935 3.8440 3.9849 4.0653 3.7612 3.9302 3.9423 3.7007 3.9819 4.0391 3.9598 3.9516 3.8363 0.9980 1.0155 1.0111 1.0001 0.9930 1.0088 0.9991 1.0093 1.0242 1.0311 1.0068 0.9644 0.9774 0.9930 1.0027 1.0030 1.0020 0.9641
dispersion: -0.026057924 hartree
energy: -2045.167492689018 hartree
dipole: -27.45375 21.94054 -5.51322 -10.64857 14.41747 3.76890 12.67905 -10.00937 2.66968
magnitude: 7.19218 au
magnitude: 18.28106 debye
