program: Orca
programVersion: 5.0.2
elementType: Cl Cl O O O N N N C C C C C C C C C C C C C C C C C C C H H H H H H H H H H H H H H H H H H
charge: 1
multiplicity: 1
keywords: wb97x-d3
keywords: def2-TZVPP
keywords: def2/J RIJCOSX
keywords: DEFGRID2
keywords: scfconv7
keywords: smallprint printgap noloewdin
keywords: NOSOSCF
formula: C19H18Cl2N3O3
InChI: InChI=1/C19H18Cl2N3O3/c1-13-9-25-19(27-13,10-24-12-22-11-23-24)17-7-6-16(8-18(17)21)26-15-4-2-14(20)3-5-15/h2-8,11-13,22H,9-10H2,1H3
45 atoms
Cl -1.916294 -1.106482 3.254342
Cl 6.624565 1.899716 -2.2499
O  -3.236078 -1.075474 -1.065868
O  -3.545203 -2.041127 0.930157
O  2.60115 -0.463319 1.291157
N  -3.382623 1.475583 0.021939
N  -2.30844 2.220001 0.340821
N  -3.222391 2.921104 -1.507183
C  -2.985943 -0.926116 0.304063
C  -3.584328 -2.442453 -1.33772
C  -3.759118 0.309883 0.79122
C  -3.376528 -3.111151 0.014584
C  -1.48617 -0.818836 0.564091
C  -2.741741 -3.013091 -2.450815
C  -0.932744 -0.879775 1.843725
C  -0.599291 -0.624407 -0.489228
C  0.425777 -0.745518 2.063834
C  0.767274 -0.494569 -0.302515
C  1.27804 -0.549322 0.985512
C  -3.937922 1.884833 -1.096107
C  -2.227618 3.100635 -0.603329
C  3.494801 0.100686 0.413635
C  3.310036 1.379179 -0.094341
C  4.636584 -0.623519 0.111817
C  4.274991 1.931033 -0.921422
C  5.60966 -0.067044 -0.704178
C  5.417609 1.204248 -1.220074
H  -4.641006 -2.468817 -1.619419
H  -3.582753 0.52874 1.840782
H  -4.826409 0.149279 0.64779
H  -4.114299 -3.880386 0.234217
H  -2.374791 -3.548676 0.09849
H  -1.682589 -3.017198 -2.190944
H  -2.87323 -2.452379 -3.376007
H  -3.046507 -4.042054 -2.645753
H  -0.978887 -0.570066 -1.499097
H  0.829294 -0.796822 3.066598
H  1.408272 -0.358128 -1.162675
H  -4.811976 1.475207 -1.574714
H  -1.485688 3.877737 -0.675773
H  2.425203 1.953194 0.149678
H  4.774858 -1.616832 0.518432
H  4.134175 2.926405 -1.319619
H  6.503958 -0.629495 -0.934877
H  -3.404825 3.47966 -2.33386
elementType: Cl O N C H
totalener: -2045.14239656 hartree
nucrepener: 2777.32865216 hartree
electener: -4822.47104871 hartree
oneelecener: -8302.39529313 hartree
twoeener: 3479.92424441 hartree
cpcmener: -0.12171270 hartree
kineticenergy: 2039.01430628 hartree
xcener: -150.068549111393 hartree
chargesum: 1.0000000
charge: -0.078457 -0.098193 -0.429205 -0.373792 -0.325762 0.131933 -0.307723 -0.090780 0.652231 0.125560 -0.092796 0.020601 -0.220692 -0.285229 0.057374 -0.135490 -0.248782 -0.224555 0.320580 0.191314 0.161693 0.298090 -0.211855 -0.246389 -0.123216 -0.111192 0.066230 0.082923 0.146440 0.136338 0.120139 0.087016 0.085576 0.097826 0.104292 0.154749 0.127167 0.156476 0.220172 0.199845 0.163535 0.151074 0.147835 0.148234 0.248865
qa: -0.0785 -0.0982 -0.4292 -0.3738 -0.3258 0.1319 -0.3077 -0.0908 0.6522 0.1256 -0.0928 0.0206 -0.2207 -0.2852 0.0574 -0.1355 -0.2488 -0.2246 0.3206 0.1913 0.1617 0.2981 -0.2119 -0.2464 -0.1232 -0.1112 0.0662 0.0829 0.1464 0.1363 0.1201 0.0870 0.0856 0.0978 0.1043 0.1547 0.1272 0.1565 0.2202 0.1998 0.1635 0.1511 0.1478 0.1482 0.2489
va: 1.2450 1.2045 1.9568 1.9958 2.0855 3.4316 2.8921 3.5672 3.7790 3.9404 3.8165 3.9304 3.5553 3.9545 3.9701 3.8724 4.1522 3.9964 3.7655 3.9250 3.9328 3.6683 3.9782 4.0507 3.9526 3.9446 3.8426 1.0057 1.0217 1.0178 0.9946 1.0043 1.0020 1.0036 1.0063 1.0182 1.0288 0.9994 0.9723 0.9776 0.9939 1.0045 1.0025 1.0012 0.9642
dispersion: -0.025379814 hartree
energy: -2045.167776372253 hartree
dipole: -23.09245 16.19708 -6.89536 -9.57878 12.75322 3.17444 -13.31152 9.77873 -3.53279
magnitude: 8.37279 au
magnitude: 21.28195 debye
