program: Gaussian 09
title: 000071109
version: EM64L-G09RevD.01
frameworkgroup: C1[X(C16H20N2O2)]
method: RPBEPBE
basis: SDD
operation: Freq
keyword: #p
keyword: freq=noraman
keyword: PBEPBE/SDD
title: #p freq=noraman PBEPBE/SDD
converged: YES YES NO NO
title: Mulliken charges:
elementType: O O N N C C C C C C C C C C C C C C C C H H H H H H H H H H H H H H H H H H H H
charge: -0.472130 -0.239020 -0.168991 -0.066798 -0.342708 -0.362801 -0.401063 -0.388141 -0.397992 -0.413002 -0.151360 0.177887 -0.483934 0.257277 0.280215 -0.360400 -0.350315 -0.240482 -0.230791 -0.235605 0.228161 0.191345 0.186211 0.221690 0.207321 0.201500 0.199774 0.205038 0.192655 0.220139 0.227164 0.236912 0.228059 0.289689 0.361000 0.233283 0.267803 0.229973 0.230693 0.231744
chargesum: 0.00000
title: Mulliken charges with hydrogens summed into heavy atoms:
elementType: O O N N C C C C C C C C C C C C C C C C
charge: -0.111130 -0.239020 -0.168991 -0.066798 0.076798 0.045100 0.007758 0.016670 0.014802 0.051074 0.076699 0.177887 -0.194245 0.257277 0.280215 -0.127117 -0.082512 -0.010509 -0.000097 -0.003861
polarizability: 3.08524839e+02 -1.67868496e+01 1.71463436e+02 -1.33726339e+01 -1.33893149e+01 1.25204433e+02
1716.lowfreq: -27.7487 -5.8501 -4.5695 0.0006 0.0009 0.0011 8.0863 21.8404 29.1576
frequency: -17.3262 21.6097 29.0926 52.5493 60.1975 86.0828 91.6761 123.6312 172.1671 201.1064 217.7648 227.2931 303.9658 308.1029 342.5535 351.8053 390.2314 400.1006 406.1707 441.5595 446.3219 454.6045 485.2983 530.2587 565.3465 614.2720 635.7740 665.4526 682.5402 696.5521 719.2052 745.4809 775.7776 793.0598 800.3474 831.1338 849.7719 850.5329 854.0274 866.5481 882.7191 901.1389 916.4119 931.6598 952.6890 982.6485 983.2523 988.9042 990.8360 999.9692 1001.2200 1016.1629 1030.4996 1047.3581 1052.7839 1080.5443 1082.8824 1105.3747 1118.0450 1148.2268 1153.4151 1161.6268 1174.9388 1178.3858 1193.4484 1237.7238 1247.1489 1262.1713 1268.2802 1272.2712 1288.6873 1299.0626 1319.8594 1325.3568 1332.0975 1340.1278 1350.6735 1357.2812 1374.1611 1379.3239 1386.4254 1400.8924 1436.6737 1451.7227 1453.1392 1456.3123 1461.6058 1465.3069 1468.7993 1480.3174 1482.7846 1570.9403 1589.6571 1618.9498 2873.5984 2879.3164 2944.8668 2955.0896 2972.0023 2985.7128 2987.6169 3034.3940 3037.1967 3042.2639 3047.8317 3055.5124 3057.0026 3129.0716 3135.1444 3137.9468 3150.0572 3161.5360 3172.4320 3263.5114
redmass: 3.7571 4.3185 4.1249 4.3046 4.3491 4.5466 5.3194 4.9668 3.3633 4.6999 3.2920 2.1434 3.6877 2.6231 2.9371 4.8412 2.1966 2.8064 4.5265 3.9535 2.8493 4.1879 3.8264 2.4593 2.3894 6.4593 6.0468 4.8970 2.9837 2.0829 3.1510 1.1469 1.7857 3.0238 1.5735 10.4406 1.6887 1.4603 1.8035 1.4836 2.7093 2.4322 8.6852 1.4331 1.3103 5.3643 1.3880 4.6693 3.1293 2.7873 1.3267 2.5378 1.9427 2.6377 3.2325 1.6177 1.4851 2.4906 2.5655 1.2729 2.2069 1.6023 1.0776 1.2870 1.1187 4.4676 1.5385 1.2952 1.2273 1.1969 1.2670 1.3943 1.2762 1.3548 1.3585 1.4168 1.4950 1.4636 1.6192 2.8992 1.8620 4.9873 2.3620 1.1592 1.2569 1.9271 1.0996 1.0988 1.0917 1.2814 2.0420 6.5736 6.7237 6.1345 1.0709 1.0699 1.0775 1.0707 1.0630 1.0615 1.0617 1.0896 1.0930 1.0926 1.1028 1.0969 1.1037 1.0849 1.0634 1.0883 1.0935 1.0967 1.1004 1.0990
irintensity: 2.3499 0.6783 0.4986 0.6086 4.6617 0.2996 1.7770 2.7858 4.8745 5.0835 0.2587 0.1007 4.2003 5.8335 0.3796 0.9967 8.8112 0.0137 2.8145 0.1548 0.2335 0.3673 5.4565 2.3695 3.5872 0.0276 5.4395 7.0024 13.4279 35.4200 4.5233 53.0908 72.6007 29.7300 2.6297 11.5329 8.2860 7.2894 7.4568 30.2147 8.4447 1.2354 7.3049 4.6306 4.0711 4.5070 0.0691 3.8244 20.2194 16.8340 0.2821 22.2296 10.5312 32.1069 34.6266 5.5178 12.1844 41.9911 7.2453 8.9843 23.4778 8.8389 3.4531 28.1782 0.7959 1.1292 17.1958 3.4196 8.9857 8.0390 20.3548 23.8905 29.1065 2.1447 7.1096 0.2611 3.0175 32.9995 39.3562 0.7199 37.8779 35.7711 27.2165 8.5594 2.0678 17.0672 8.4196 13.1897 5.5886 16.3049 51.6852 46.4125 10.0853 0.5025 36.2033 130.1702 33.2239 44.6426 40.7393 27.9090 27.9275 46.8244 65.6079 17.0482 22.4218 24.6898 102.0313 2.4582 341.1244 4.0881 25.6164 21.5386 14.9719 6.3878
temp: 298.150 k
press: 1.00000 atm
elementType: 8 8 7 7 6 6 6 6 6 6 6 6 6 6 6 6 6 6 6 6 1 1 1 1 1 1 1 1 1 1 1 1 1 1 1 1 1 1 1 1
symmnumber: 1
zpe: 870671.8 jmol-1
zpe.correction: 0.331621 hartree
zpe.thermalcorrener: 0.348687 hartree
zpe.thermalcorrenthalpy: 0.349631 hartree
zpe.thermalcorrgfe: 0.284875 hartree
zpe.sumelectzpe: -880.112241 hartree
zpe.sumelectthermal: -880.095175 hartree
zpe.sumelectthermalent: -880.094231 hartree
zpe.sumelectthermalfe: -880.158988 hartree
dipole: 2.4074 2.1224 1.4398
dipole: 3.5175
quadrupole: -86.0778 -119.9060 -123.3656
quadrupole: -6.9539 1.6487 0.5069
quadrupole: 23.7053 -10.1228 -13.5825 -6.9539 1.6487 0.5069
hfenergy: -880.443862 hartree
pointgroup: C01 [X(C16H20N2O2)]
dipole: 0.9559775 0.9891187 0.1514458 debye
polarizability: 308.1443572|-22.3070256|152.0941455|-2.0054456|-26.8578582|144.9542054 unknown
InChI: InChI=1S/C16H20N2O2/c19-15(12-18-9-5-2-6-10-18)14-11-16(20-17-14)13-7-3-1-4-8-13/h1,3-4,7-8,11,15,19H,2,5-6,9-10,12H2
charge 0 multiplicity 1
40 atoms
O  1.640878 -0.039008 -1.485088
O  -1.995129 -1.304104 1.051154
N  3.577246 0.148812 0.317244
N  -0.564994 -1.636322 1.003458
C  4.52766 -0.994178 0.183487
C  4.192096 1.304557 1.028542
C  5.806365 -0.567477 -0.564637
C  5.460718 1.790222 0.298564
C  6.477156 0.636812 0.133699
C  2.258126 -0.254306 0.870032
C  1.402805 -0.852209 -0.297476
C  -0.070917 -0.82909 0.03133
C  -1.072915 0.003575 -0.564871
C  -2.260045 -0.312035 0.086864
C  -3.642375 0.156027 -0.028474
C  -3.985035 1.143514 -0.993637
C  -4.658459 -0.365895 0.819824
C  -5.314098 1.597917 -1.106318
C  -5.986077 0.093181 0.702563
C  -6.320761 1.075761 -0.259065
H  4.02006 -1.80874 -0.364342
H  4.798178 -1.389194 1.194067
H  4.455865 1.02601 2.079162
H  3.442886 2.115779 1.077459
H  5.539629 -0.294203 -1.604161
H  6.501041 -1.427335 -0.616064
H  5.908236 2.628904 0.865088
H  5.17403 2.176776 -0.699061
H  6.846016 0.324962 1.132783
H  7.357443 0.977027 -0.44297
H  2.326297 -0.982443 1.706698
H  1.752421 0.654096 1.243751
H  1.713367 -1.902603 -0.483133
H  -0.892527 0.707963 -1.37048
H  2.562881 0.344227 -1.295072
H  -3.212293 1.551031 -1.654622
H  -4.396125 -1.126199 1.561952
H  -5.566169 2.357677 -1.854114
H  -6.760688 -0.315042 1.360845
H  -7.353394 1.430455 -0.34848
