program: Orca
programVersion: 5.0.2
elementType: Cl Cl O N N N C C C C C C C C C C C C C C C H H H H H H H H H H H H H H H H H H
charge: 1
multiplicity: 1
keywords: wb97x-d3
keywords: def2-TZVPP
keywords: def2/J RIJCOSX
keywords: DEFGRID2
keywords: scfconv7
keywords: smallprint printgap noloewdin
keywords: NOSOSCF
formula: C15H18Cl2N3O
InChI: InChI=1/C15H18Cl2N3O/c1-15(2,3)14(21)13(20-9-18-8-19-20)6-10-4-5-11(16)7-12(10)17/h4-9,14,19,21H,1-3H3
39 atoms
Cl -1.010603 0.003798 2.588928
Cl -5.519235 -0.2377 -0.289764
O  1.998247 -1.517037 1.085292
N  2.584878 1.027382 0.071267
N  3.59756 0.562893 0.814071
N  4.325602 2.309103 -0.254768
C  1.599201 -1.692988 -1.358955
C  1.21151 -1.0600 0.001248
C  0.656258 -1.149433 -2.431508
C  1.38202 -3.205823 -1.238847
C  3.049068 -1.435561 -1.767402
C  1.281252 0.445222 0.061179
C  0.25246 1.285255 0.110272
C  -1.16416 0.881472 0.031949
C  3.062567 2.092003 -0.568624
C  -1.8392 0.299488 1.101581
C  -1.883935 1.136411 -1.131986
C  4.6353 1.344976 0.598822
C  -3.17666 -0.05331 1.012828
C  -3.22018 0.797098 -1.24643
C  -3.852315 0.196319 -0.169319
H  0.160129 -1.321981 0.165117
H  0.776106 -0.074962 -2.58278
H  0.858647 -1.634671 -3.387771
H  -0.39014 -1.340786 -2.18424
H  2.108758 -3.687213 -0.580389
H  1.493566 -3.677775 -2.216295
H  0.380485 -3.444899 -0.873249
H  3.761798 -1.735838 -0.997337
H  3.238844 -0.393975 -2.031066
H  3.283954 -2.022425 -2.657587
H  0.436362 2.353173 0.182561
H  1.918419 -2.47394 1.171388
H  2.463708 2.665473 -1.258778
H  -1.383305 1.600672 -1.971906
H  5.591958 1.182903 1.069556
H  -3.680116 -0.509657 1.854001
H  -3.755071 0.997746 -2.164481
H  3.480603 -0.299982 1.350353
elementType: Cl O N C H
totalener: -1742.23613784 hartree
nucrepener: 2012.12980311 hartree
electener: -3754.36594095 hartree
oneelecener: -6363.46352532 hartree
twoeener: 2609.09758437 hartree
cpcmener: -0.09638772 hartree
kineticenergy: 1737.22594877 hartree
xcener: -122.762039951429 hartree
chargesum: 1.0000000
charge: -0.065452 -0.074004 -0.398516 0.084990 -0.034321 -0.351002 0.312694 0.066875 -0.388282 -0.350697 -0.378333 -0.042865 0.010754 0.011504 0.174856 0.039981 -0.177175 0.204155 -0.162598 -0.151704 0.107763 0.133432 0.102640 0.113966 0.105472 0.099337 0.100264 0.113107 0.103007 0.101996 0.112229 0.156956 0.232612 0.198093 0.150993 0.203321 0.128930 0.148121 0.256900
qa: -0.0655 -0.0740 -0.3985 0.0850 -0.0343 -0.3510 0.3127 0.0669 -0.3883 -0.3507 -0.3783 -0.0429 0.0108 0.0115 0.1749 0.0400 -0.1772 0.2042 -0.1626 -0.1517 0.1078 0.1334 0.1026 0.1140 0.1055 0.0993 0.1003 0.1131 0.1030 0.1020 0.1122 0.1570 0.2326 0.1981 0.1510 0.2033 0.1289 0.1481 0.2569
va: 1.2597 1.2288 2.0028 3.4750 3.4438 3.0525 3.6114 4.0155 3.9654 3.9408 3.9544 3.7341 3.8405 3.6291 3.9793 3.9284 3.9210 3.9442 4.0912 3.9989 3.8896 1.0105 0.9952 1.0076 1.0007 1.0067 1.0052 0.9984 1.0140 0.9975 1.0069 0.9971 1.0109 0.9798 1.0012 0.9733 1.0213 1.0035 1.0031
dispersion: -0.023803809 hartree
energy: -1742.259941653683 hartree
dipole: 28.64005 -24.03155 4.60849 -12.94224 13.14896 0.20672 -19.40145 19.08621 -0.31524
magnitude: 4.62388 au
magnitude: 11.75298 debye
