program: Orca
programVersion: 5.0.2
elementType: Cl Cl O N N N C C C C C C C C C C C C C C C H H H H H H H H H H H H H H H H H H
charge: 1
multiplicity: 1
keywords: wb97x-d3
keywords: def2-TZVPP
keywords: def2/J RIJCOSX
keywords: DEFGRID2
keywords: scfconv7
keywords: smallprint printgap noloewdin
keywords: NOSOSCF
formula: C15H18Cl2N3O
InChI: InChI=1/C15H18Cl2N3O/c1-15(2,3)14(21)13(20-9-18-8-19-20)6-10-4-5-11(16)7-12(10)17/h4-9,14,19,21H,1-3H3
39 atoms
Cl 1.061508 -2.236247 1.412146
Cl 5.467695 0.427186 -0.09031
O  -3.253328 0.504657 -1.814361
N  -1.115319 1.056744 -0.119302
N  -1.665721 2.185964 -0.588425
N  -0.4353 2.723114 1.125592
C  -3.638698 -0.986067 0.134187
C  -2.744294 -0.589115 -1.064352
C  -3.00604 -2.192511 0.828877
C  -5.008395 -1.398905 -0.419992
C  -3.8346 0.147653 1.141182
C  -1.321384 -0.217289 -0.730849
C  -0.264362 -0.988548 -0.965249
C  1.145063 -0.621679 -0.737211
C  -0.369937 1.421538 0.923285
C  1.868906 -1.175816 0.314111
C  1.797544 0.25996 -1.594513
C  -1.247258 3.173886 0.187242
C  3.198955 -0.860485 0.526765
C  3.127817 0.588487 -1.403776
C  3.821622 0.025307 -0.341396
H  -2.667624 -1.474367 -1.709095
H  -3.647434 -2.537925 1.639613
H  -2.873049 -3.033951 0.145207
H  -2.03296 -1.961063 1.26382
H  -5.62081 -1.822405 0.375962
H  -4.925917 -2.161503 -1.198047
H  -5.581009 -0.55734 -0.81865
H  -2.925859 0.381703 1.697597
H  -4.574953 -0.146854 1.885205
H  -4.207329 1.061681 0.676293
H  -0.463784 -1.975723 -1.370194
H  -2.374407 2.101207 -1.32097
H  0.183938 0.712734 1.518912
H  1.261155 0.681148 -2.435204
H  -1.549063 4.200312 0.047082
H  3.741615 -1.296406 1.354029
H  3.625808 1.269405 -2.07938
H  -4.136392 0.299711 -2.137705
totalener: -1742.14439385 hartree
nucrepener: 2016.46845404 hartree
electener: -3758.61284789 hartree
oneelecener: -6372.64951452 hartree
twoeener: 2614.03666663 hartree
kineticenergy: 1737.27309291 hartree
xcener: -122.770576831150 hartree
chargesum: 1.0000000
charge: -0.028856 -0.007332 -0.370960 0.102882 -0.049956 -0.263260 0.235581 0.053099 -0.321601 -0.325157 -0.351852 -0.059026 -0.020821 -0.084203 0.138200 -0.023716 -0.117358 0.181146 -0.114998 -0.128920 0.079522 0.134487 0.117174 0.106655 0.083893 0.109082 0.121636 0.091142 0.094160 0.122938 0.096698 0.150439 0.238488 0.189762 0.140965 0.190439 0.138284 0.142485 0.208861
qa: -0.0289 -0.0073 -0.3710 0.1029 -0.0500 -0.2633 0.2356 0.0531 -0.3216 -0.3252 -0.3519 -0.0590 -0.0208 -0.0842 0.1382 -0.0237 -0.1174 0.1811 -0.1150 -0.1289 0.0795 0.1345 0.1172 0.1067 0.0839 0.1091 0.1216 0.0911 0.0942 0.1229 0.0967 0.1504 0.2385 0.1898 0.1410 0.1904 0.1383 0.1425 0.2089
va: 1.3042 1.2983 2.0409 3.4209 3.4151 3.0633 3.6267 3.9811 3.9470 3.9344 3.9393 3.7412 3.8768 3.6691 3.9828 3.9813 3.8933 3.9540 4.0116 4.0307 4.0255 1.0058 1.0111 1.0091 1.0102 1.0110 0.9987 1.0090 1.0014 1.0136 1.0180 1.0026 1.0271 0.9910 1.0065 0.9784 1.0147 1.0085 1.0375
dispersion: -0.023924251 hartree
energy: -1742.168318105480 hartree
dipole: -45.96311 42.81307 -3.15004 -2.54251 3.82855 1.28604 -3.36136 2.21915 -1.14220
magnitude: 3.58905 au
magnitude: 9.12263 debye
