program: Gaussian 09
title: 000071070
version: EM64L-G09RevD.01
frameworkgroup: C1[X(C6H14N4O2)]
method: RPBEPBE
basis: SDD
operation: Freq
keyword: #p
keyword: freq=noraman
keyword: PBEPBE/SDD
title: #p freq=noraman PBEPBE/SDD
converged: YES YES NO NO
title: Mulliken charges:
elementType: O O N N N N C C C C C C H H H H H H H H H H H H H H
charge: -0.418571 -0.235141 -0.558228 -0.109648 -0.633837 -0.658851 -0.378287 -0.384371 -0.200212 -0.454338 0.151227 0.207993 0.246662 0.216209 0.184083 0.220202 0.240949 0.194246 0.196439 0.281075 0.269299 0.369660 0.319496 0.290990 0.309046 0.333911
chargesum: 0.00000
title: Mulliken charges with hydrogens summed into heavy atoms:
elementType: O O N N N N C C C C C C
charge: -0.048911 -0.235141 -0.007855 -0.109648 -0.023352 -0.015894 0.084584 0.019913 0.040736 -0.063653 0.151227 0.207993
polarizability: 1.24768516e+02 5.91363905e+00 9.77896228e+01 8.77178401e-01 4.64375727e+00 8.63667873e+01
1716.lowfreq: -9.2004 -6.9832 -0.0004 -0.0004 0.0007 6.0214 16.7281 27.6447 36.6201
frequency: 16.5255 27.5414 36.6165 55.7967 100.6856 151.8164 181.8115 192.6325 235.4376 249.2760 278.3225 295.7935 352.9294 368.8913 397.0917 424.3640 447.2279 472.3808 495.7483 554.4557 572.1345 598.9006 615.3447 676.2321 684.2411 717.1936 758.6199 782.2817 869.4636 899.5502 962.6294 986.5235 1020.6288 1030.3448 1032.3715 1076.8552 1081.6816 1121.2251 1152.6529 1180.0452 1187.8755 1231.3729 1248.9622 1278.0920 1307.0577 1318.5940 1347.6768 1362.1029 1366.3195 1406.3712 1453.9486 1457.7868 1475.0583 1600.9203 1613.8875 1643.8788 1654.0156 1672.1961 2870.5584 2916.7839 2982.6400 2992.6558 3034.1902 3043.5215 3067.9594 3432.9212 3490.1354 3520.5200 3549.9965 3558.1282 3668.7168 3696.3059
redmass: 4.8939 4.3707 8.7713 4.3745 4.2536 2.3481 3.0815 3.7425 1.8789 2.7905 1.6638 2.2996 3.1304 1.2514 1.2824 1.1820 1.9020 3.0942 2.7798 2.4126 1.4501 3.1171 1.2567 4.9365 1.5731 2.8351 2.4773 2.0402 2.7293 1.8659 2.9897 2.3302 2.1170 2.5076 1.4515 1.7898 2.2636 2.8072 1.5065 1.8863 1.4051 1.4914 1.3591 1.2251 1.2283 1.5651 1.4205 1.3606 1.4947 4.3163 1.0865 1.0880 1.0891 1.2210 1.2739 1.1081 7.2175 3.7153 1.0558 1.1008 1.0619 1.0598 1.0926 1.0929 1.1025 1.0449 1.0638 1.0450 1.0453 1.0967 1.1017 1.1027
irintensity: 1.8110 2.9924 2.3345 1.3047 0.7778 2.7309 3.3230 2.9136 30.0554 1.3148 32.1023 13.1676 15.0279 99.1809 184.4634 125.0637 24.5176 30.6733 11.4379 115.2530 139.7597 2.8652 143.2007 76.5276 240.1759 39.2473 3.2884 8.3157 8.6514 10.1979 17.0727 35.8605 5.2219 227.3064 7.8548 11.9350 2.6553 11.1576 6.8970 4.8918 6.8900 1.6765 4.0690 4.2911 7.9612 7.1235 43.9534 4.9139 15.6747 123.4317 7.0460 21.7149 16.1805 142.6211 73.3049 26.2898 200.6918 564.0185 82.9484 58.0621 37.9220 29.0656 13.3190 13.1783 51.8624 1.4315 10.3657 18.5295 17.4557 1.6415 19.3454 18.9921
temp: 298.150 k
press: 1.00000 atm
elementType: 8 8 7 7 7 7 6 6 6 6 6 6 1 1 1 1 1 1 1 1 1 1 1 1 1 1
symmnumber: 1
zpe: 565866.0 jmol-1
zpe.correction: 0.215527 hartree
zpe.thermalcorrener: 0.230028 hartree
zpe.thermalcorrenthalpy: 0.230973 hartree
zpe.thermalcorrgfe: 0.171868 hartree
zpe.sumelectzpe: -605.521817 hartree
zpe.sumelectthermal: -605.507315 hartree
zpe.sumelectthermalent: -605.506371 hartree
zpe.sumelectthermalfe: -605.565475 hartree
dipole: 3.2651 -0.9544 -1.0210
dipole: 3.5516
quadrupole: -47.3785 -72.4866 -71.3626
quadrupole: -0.3291 2.7487 2.9993
quadrupole: 16.3640 -8.7440 -7.6201 -0.3291 2.7487 2.9993
hfenergy: -605.7373435 hartree
pointgroup: C01 [X(C6H14N4O2)]
dipole: -1.2730112 -0.3897136 0.4243046 debye
dipolederiv: -0.5039685 0.0768654 -0.2584554 0.0491893 -0.3082041 0.214537 -0.2125194 0.3240021 -1.0869676 -0.358648 -0.0844829 -0.0818506 -0.0685249 -0.9589777 0.1588592 -0.1044747 -0.0206393 -0.5968801 -0.3706102 -0.1140436 0.0696295 -0.0859705 -0.4491408 -0.2360084 0.1516372 -0.2135865 -0.7102954 -1.4228614 0.4532788 -0.0447533 0.2617058 -0.5859815 0.0629636 0.0136639 0.0438878 -0.3986725 -0.5888863 0.3970838 0.1337895 0.5413024 -1.0940976 0.0152062 0.2128369 -0.1108857 -0.6004021 -1.0613073 -0.3090112 -0.0940513 -0.48029 -0.5600559 0.1081923 -0.1104198 0.0541321 -0.6582544 0.0380457 0.0477571 0.0718721 -0.0352226 0.0776596 -0.0046451 -0.0270888 0.0173215 0.0017264 -0.0103056 -0.0211983 0.0162622 -0.0246121 0.1807592 -0.0193726 -0.0087024 -0.0113298 0.0743016 0.2024641 -0.0556796 -0.1757672 -0.0155347 0.1809322 -0.042112 -0.1689582 0.0111711 0.3928348 0.4531083 -0.201351 0.0258729 -0.3117569 0.4118267 0.0022546 0.1091517 0.0044562 0.3462433 0.2629751 0.0601962 0.4148501 0.1755435 1.1090057 -0.2771476 0.4592351 -0.161675 1.2219574 1.9255614 -0.307555 -0.078692 -0.1566106 1.3563752 -0.254925 -0.1552879 -0.3089196 0.2705833 0.124464 0.0092443 -0.0256287 0.0233291 -0.0518881 0.0885657 -0.0539886 0.0582839 0.037869 0.0244585 -0.0734546 -0.0468781 -0.0309559 -0.030738 -0.1070259 -0.0286088 -0.0989969 -0.0327372 -0.0177115 0.0947012 -0.0304322 0.0994074 -0.1360788 0.1098838 -0.0025656 0.070671 0.0253011 0.0663207 -0.0267097 -0.0266428 -0.0744774 -0.0294925 -0.1192778 -0.0096138 -0.0873724 -0.0556304 0.0322537 0.0610698 -0.0131966 0.0685551 -0.0642749 0.0540816 -0.0305572 0.0608339 -0.0104861 -0.0054487 -0.0000463 -0.0416249 0.1045589 -0.1855355 -0.0859824 -0.0664178 -0.1510417 -0.0651903 -0.0899084 -0.036882 0.1341682 0.0585968 -0.0718024 0.0951436 0.0392998 0.1640151 -0.1554604 0.2027439 0.076285 0.044441 0.0791532 0.0839036 0.1462587 0.0464567 0.0452014 0.2711819 -0.0348194 -0.0104934 0.020041 -0.1099522 0.2717016 0.1244887 -0.0499441 0.0734562 0.2011412 0.4010725 -0.0239222 -0.0355119 -0.059622 0.0933144 -0.1183491 -0.0191667 -0.0663818 0.2640534 0.1561162 -0.0619809 -0.0072391 -0.0449666 0.2471067 0.0505149 -0.0223366 0.1014166 0.3154411 0.1641618 -0.0418278 -0.0927046 -0.0457135 0.2061766 0.0178993 -0.2117498 0.1391936 0.2819346 0.1642465 0.0290605 0.0762535 0.021449 0.1707827 -0.0130374 0.1801081 0.0192471 0.3413228 0.2464832 0.0630963 0.0462489 0.0614194 0.1367235 0.0290343 0.0700109 0.0435392 0.3250846 unknown
polarizability: 124.7016885|-6.2143312|98.30567|-0.7566946|-3.8144251|85.9175676 unknown
InChI: InChI=1S/C6H14N4O2/c7-4(5(11)12)2-1-3-10-6(8)9/h4,11H,1-3,7-9H2
charge 0 multiplicity 1
26 atoms
O  3.046167 0.048117 1.611844
O  2.710252 1.723714 0.039328
N  2.925417 -0.456043 -1.966362
N  -1.96545 0.086458 -0.065713
N  -3.732451 1.626642 -0.239741
N  -4.274125 -0.597044 0.283415
C  0.802935 -0.778048 -0.739972
C  0.079125 -1.133317 0.574264
C  2.345307 -0.649471 -0.624938
C  -1.44866 -1.226695 0.370249
C  2.699999 0.505645 0.328318
C  -3.254117 0.32494 -0.011083
H  0.376017 0.16549 -1.130886
H  0.618907 -1.563735 -1.4980
H  0.456211 -2.099726 0.967045
H  0.276508 -0.365979 1.345974
H  2.753039 -1.579335 -0.190556
H  -1.653652 -2.012451 -0.395677
H  -1.91853 -1.57229 1.323403
H  2.57693 0.397972 -2.419291
H  3.951243 -0.491349 -1.982539
H  3.243358 0.830934 2.196844
H  -3.003707 2.321718 -0.396579
H  -4.61497 1.751776 -0.734515
H  -5.161129 -0.277148 0.666048
H  -4.043026 -1.582373 0.369622
