program: Orca
programVersion: 5.0.2
elementType: Cl N N N N C C C C C C C C C C C C C C C C C C C H H H H H H H H H H H H H H H H H H
charge: 1
multiplicity: 1
keywords: wb97x-d3
keywords: def2-TZVPP
keywords: def2/J RIJCOSX
keywords: DEFGRID2
keywords: scfconv7
keywords: smallprint printgap noloewdin
keywords: NOSOSCF
formula: C19H18ClN4
InChI: InChI=1/C19H18ClN4/c20-18-8-6-16(7-9-18)10-11-19(12-21,13-24-15-22-14-23-24)17-4-2-1-3-5-17/h1-9,14-15,23H,10-11,13H2
42 atoms
Cl -4.601119 0.255237 -1.335992
N  3.054425 0.965091 1.146801
N  2.854499 1.366951 2.411663
N  3.166269 3.152216 1.205019
N  0.67606 -0.813397 3.052135
C  1.461742 -0.865456 0.563957
C  1.446915 -2.317789 0.023988
C  2.941508 -0.417932 0.706794
C  0.738903 0.136101 -0.329215
C  0.135987 -3.077432 0.258447
C  -1.095442 -2.3174 -0.15209
C  0.9399 -0.856092 1.933094
C  1.163513 0.276199 -1.65005
C  -0.289754 0.943561 0.13583
C  -2.020361 -1.898198 0.795589
C  -1.313296 -1.975973 -1.484424
C  0.560342 1.196099 -2.490894
C  -0.902542 1.856303 -0.712215
C  3.229498 2.078057 0.441251
C  -0.47956 1.987942 -2.023945
C  -3.1135 -1.121234 0.439245
C  -2.391302 -1.195093 -1.856412
C  2.924647 2.692192 2.415653
C  -3.282013 -0.758053 -0.885498
H  2.259766 -2.882276 0.490239
H  1.674992 -2.27396 -1.041958
H  3.492505 -1.052117 1.402535
H  3.443768 -0.475269 -0.257082
H  0.062685 -3.353804 1.312455
H  0.207368 -4.019599 -0.290248
H  1.950479 -0.352472 -2.052996
H  -0.655823 0.845128 1.149555
H  2.585559 0.718167 3.145593
H  -0.624925 -2.311551 -2.251263
H  0.892755 1.283227 -3.51663
H  -1.723687 2.455667 -0.343725
H  3.401377 2.066595 -0.624082
H  -0.961967 2.696636 -2.682906
H  -3.825429 -0.801648 1.1877
H  -2.542049 -0.925549 -2.892392
H  2.801078 3.282125 3.311085
H  -1.890459 -2.172404 1.83563
totalener: -1413.86904065 hartree
nucrepener: 2220.14630979 hartree
electener: -3634.01535044 hartree
oneelecener: -6317.91379898 hartree
twoeener: 2683.89844854 hartree
kineticenergy: 1409.07633968 hartree
xcener: -115.522577501388 hartree
chargesum: 1.0000000
charge: -0.050186 0.079101 -0.054393 -0.265255 0.017472 0.865319 -0.231995 -0.233274 -0.185247 -0.137563 0.094369 -0.523092 -0.362522 -0.131924 -0.186067 -0.183175 -0.106857 -0.116771 0.176339 -0.094016 -0.110850 -0.135140 0.183205 0.070572 0.108259 0.123735 0.173346 0.154387 0.112931 0.122601 0.125950 0.145908 0.233797 0.111340 0.152931 0.148760 0.176033 0.151885 0.133012 0.127786 0.195182 0.124108
qa: -0.0502 0.0791 -0.0544 -0.2653 0.0175 0.8653 -0.2320 -0.2333 -0.1852 -0.1376 0.0944 -0.5231 -0.3625 -0.1319 -0.1861 -0.1832 -0.1069 -0.1168 0.1763 -0.0940 -0.1109 -0.1351 0.1832 0.0706 0.1083 0.1237 0.1733 0.1544 0.1129 0.1226 0.1259 0.1459 0.2338 0.1113 0.1529 0.1488 0.1760 0.1519 0.1330 0.1278 0.1952 0.1241
va: 1.2579 3.3552 3.4699 3.0644 3.0218 3.0583 3.8819 3.8611 3.5188 3.8147 3.5250 4.0390 4.0308 3.8435 3.9366 3.9904 3.9772 3.9485 3.9955 3.9489 3.9830 3.9301 3.9604 3.9226 1.0172 0.9945 0.9992 0.9904 1.0089 1.0045 1.0212 1.0032 1.0002 1.0083 0.9942 1.0014 0.9904 0.9952 1.0103 1.0128 0.9766 1.0108
dispersion: -0.029085818 hartree
energy: -1413.898126463629 hartree
dipole: 16.49552 -11.75577 4.73975 -7.11589 7.92346 0.80756 -0.77243 1.92255 1.15012
magnitude: 4.94370 au
magnitude: 12.56588 debye
