program: Orca
programVersion: 5.0.2
elementType: Cl N N N N C C C C C C C C C C C C C C C C C C C H H H H H H H H H H H H H H H H H H
charge: 1
multiplicity: 1
keywords: wb97x-d3
keywords: def2-TZVPP
keywords: def2/J RIJCOSX
keywords: DEFGRID2
keywords: scfconv7
keywords: smallprint printgap noloewdin
keywords: NOSOSCF
formula: C19H18ClN4
InChI: InChI=1/C19H18ClN4/c20-18-8-6-16(7-9-18)10-11-19(12-21,13-24-15-22-14-23-24)17-4-2-1-3-5-17/h1-9,14-15,23H,10-11,13H2
42 atoms
Cl -5.381859 0.768485 -0.415263
N  0.445985 1.369049 0.268678
N  -0.591932 1.381335 1.115462
N  0.80413 2.918647 1.773117
N  1.413416 -2.067032 -2.826784
C  1.421172 -0.799528 -0.54125
C  0.830339 -1.743019 0.534867
C  0.557069 0.457287 -0.85735
C  2.822771 -0.309308 -0.179952
C  -0.407099 -2.569183 0.163581
C  -1.674245 -1.775794 0.010521
C  1.452179 -1.522084 -1.815689
C  3.687989 0.120633 -1.184192
C  3.222161 -0.186332 1.147722
C  -2.228369 -1.518251 -1.24016
C  -2.328369 -1.265097 1.13352
C  4.923746 0.661767 -0.866917
C  4.460352 0.356624 1.463888
C  1.279195 2.311574 0.700347
C  5.31239 0.785455 0.459574
C  -3.367341 -0.737148 -1.379014
C  -3.472829 -0.484827 1.011853
C  -0.349813 2.327858 2.012456
C  -3.980442 -0.207761 -0.253164
H  0.626066 -1.1715 1.444447
H  1.626851 -2.440479 0.799605
H  1.023393 1.018301 -1.666062
H  -0.448971 0.19873 -1.181529
H  -0.540693 -3.304127 0.960662
H  -0.214175 -3.149234 -0.740293
H  3.416645 0.013492 -2.228264
H  2.589047 -0.524013 1.957093
H  -1.371656 0.720094 1.026727
H  -1.965829 -1.512861 2.126229
H  5.588616 0.97516 -1.660143
H  4.758537 0.435827 2.500459
H  2.212568 2.532937 0.204014
H  6.279171 1.202096 0.706734
H  -3.782367 -0.550037 -2.360013
H  -3.98933 -0.127421 1.893351
H  -1.031768 2.562844 2.815232
H  -1.765163 -1.934434 -2.127598
totalener: -1413.87092238 hartree
nucrepener: 2152.60600743 hartree
electener: -3566.47692980 hartree
oneelecener: -6181.18380490 hartree
twoeener: 2614.70687509 hartree
kineticenergy: 1409.04670284 hartree
xcener: -115.515026281266 hartree
chargesum: 1.0000000
charge: -0.010517 0.105498 -0.064087 -0.265414 0.050404 0.699423 -0.291680 -0.351764 -0.084872 -0.129194 0.021752 -0.411604 -0.191812 -0.246574 -0.182004 -0.242554 -0.128459 -0.100450 0.158091 -0.104951 -0.113703 -0.186487 0.176556 0.074746 0.087899 0.146085 0.183286 0.180936 0.127244 0.128243 0.139998 0.135181 0.220016 0.158342 0.153559 0.149496 0.190668 0.154268 0.152116 0.162204 0.186716 0.163401
qa: -0.0105 0.1055 -0.0641 -0.2654 0.0504 0.6994 -0.2917 -0.3518 -0.0849 -0.1292 0.0218 -0.4116 -0.1918 -0.2466 -0.1820 -0.2426 -0.1285 -0.1004 0.1581 -0.1050 -0.1137 -0.1865 0.1766 0.0747 0.0879 0.1461 0.1833 0.1809 0.1272 0.1282 0.1400 0.1352 0.2200 0.1583 0.1536 0.1495 0.1907 0.1543 0.1521 0.1622 0.1867 0.1634
va: 1.2991 3.3120 3.3743 3.0651 3.0645 3.3244 3.9234 3.9114 3.4995 3.8436 3.4680 4.0359 4.0195 3.9515 3.9348 3.9011 4.0031 4.0031 3.9988 3.9621 3.9870 3.9077 3.9645 3.9859 1.0035 1.0066 0.9992 1.0088 1.0048 1.0087 1.0147 1.0106 1.0544 1.0036 0.9978 0.9984 0.9799 0.9949 1.0050 1.0058 0.9806 1.0043
dispersion: -0.026835762 hartree
energy: -1413.897758139610 hartree
dipole: 19.56167 -19.01920 0.54247 -5.72476 7.07263 1.34787 4.83343 -3.11018 1.72325
magnitude: 2.25402 au
magnitude: 5.72926 debye
