program: Orca
programVersion: 5.0.2
elementType: Cl N N N N C C C C C C C C C C C C C C C C C C C H H H H H H H H H H H H H H H H H H
charge: 1
multiplicity: 1
keywords: wb97x-d3
keywords: def2-TZVPP
keywords: def2/J RIJCOSX
keywords: DEFGRID2
keywords: scfconv7
keywords: smallprint printgap noloewdin
keywords: NOSOSCF
formula: C19H18ClN4
InChI: InChI=1/C19H18ClN4/c20-18-8-6-16(7-9-18)10-11-19(12-21,13-24-15-22-14-23-24)17-4-2-1-3-5-17/h1-9,14-15,23H,10-11,13H2
42 atoms
Cl 1.15417 -4.835946 -2.050355
N  -1.078421 3.435728 0.377725
N  -2.075679 3.076474 -0.440011
N  -2.926521 4.358449 1.099498
N  -0.315009 1.651395 3.353996
C  0.452569 1.522766 0.858388
C  1.971787 1.223987 0.86572
C  0.281996 2.947372 0.277662
C  -0.370962 0.52381 0.054821
C  2.387625 -0.114866 1.476732
C  2.100462 -1.317915 0.621462
C  0.00898 1.568844 2.252399
C  -1.488807 -0.112828 0.579125
C  -0.004544 0.264984 -1.265214
C  2.819442 -1.537969 -0.550732
C  1.107118 -2.227516 0.964845
C  -2.21633 -1.010354 -0.191951
C  -0.727128 -0.633972 -2.031993
C  -1.629365 4.205208 1.305564
C  -1.834299 -1.280043 -1.495639
C  2.541341 -2.617045 -1.374901
C  0.80959 -3.312102 0.152702
C  -3.175347 3.647043 0.011203
C  1.528671 -3.493151 -1.017068
H  2.454916 2.025666 1.427882
H  2.340721 1.304568 -0.158478
H  0.901436 3.660911 0.818039
H  0.585877 2.960984 -0.767352
H  1.929348 -0.239654 2.460488
H  3.463452 -0.053728 1.653145
H  -1.805807 0.072428 1.597531
H  0.853802 0.757081 -1.705459
H  -1.930203 2.469245 -1.244197
H  0.539492 -2.083286 1.875928
H  -3.079957 -1.502134 0.235684
H  -0.420661 -0.833169 -3.050392
H  -1.051637 4.643171 2.104257
H  -2.394601 -1.986215 -2.093906
H  3.108011 -2.769585 -2.283664
H  0.023458 -4.001119 0.43054
H  -4.130142 3.527045 -0.474823
H  3.607037 -0.850628 -0.836609
elementType: Cl N C H
totalener: -1413.97586048 hartree
nucrepener: 2173.88055447 hartree
electener: -3587.85641495 hartree
oneelecener: -6224.25311203 hartree
twoeener: 2636.39669708 hartree
cpcmener: -0.13558895 hartree
kineticenergy: 1409.02065040 hartree
xcener: -115.511287129345 hartree
chargesum: 1.0000000
charge: -0.106241 0.075648 -0.022512 -0.363405 -0.070917 0.795111 -0.218483 -0.104483 -0.340074 -0.090234 0.075373 -0.376500 -0.131234 -0.185994 -0.231831 -0.178591 -0.118853 -0.170235 0.168032 -0.154309 -0.143683 -0.184273 0.201665 0.101476 0.124164 0.123419 0.158449 0.173442 0.094193 0.113121 0.131713 0.141775 0.256353 0.141696 0.159476 0.159172 0.207772 0.159959 0.142613 0.142124 0.204882 0.140222
qa: -0.1062 0.0756 -0.0225 -0.3634 -0.0709 0.7951 -0.2185 -0.1045 -0.3401 -0.0902 0.0754 -0.3765 -0.1312 -0.1860 -0.2318 -0.1786 -0.1189 -0.1702 0.1680 -0.1543 -0.1437 -0.1843 0.2017 0.1015 0.1242 0.1234 0.1584 0.1734 0.0942 0.1131 0.1317 0.1418 0.2564 0.1417 0.1595 0.1592 0.2078 0.1600 0.1426 0.1421 0.2049 0.1402
va: 1.1979 3.3986 3.5006 3.0436 3.1074 3.3701 3.9031 3.7768 3.5692 3.8531 3.5072 4.1298 3.7913 3.9192 3.9639 3.9182 3.8723 3.8648 3.9861 3.8612 3.9545 3.9414 3.9423 3.7646 1.0091 0.9996 1.0004 0.9874 1.0155 0.9989 1.0215 1.0132 0.9625 1.0018 0.9904 0.9929 0.9768 0.9897 1.0053 1.0078 0.9727 1.0040
dispersion: -0.027969280 hartree
energy: -1414.003829757020 hartree
dipole: 2.58654 -3.77425 -1.18771 13.68120 -7.54558 6.13562 2.45498 -4.31897 -1.86399
magnitude: 6.52158 au
magnitude: 16.57653 debye
