program: Orca
programVersion: 5.0.2
elementType: Cl N N N N C C C C C C C C C C C C C C C C C C C H H H H H H H H H H H H H H H H H H
charge: 1
multiplicity: 1
keywords: wb97x-d3
keywords: def2-TZVPP
keywords: def2/J RIJCOSX
keywords: DEFGRID2
keywords: scfconv7
keywords: smallprint printgap noloewdin
keywords: NOSOSCF
formula: C19H18ClN4
InChI: InChI=1/C19H18ClN4/c20-18-8-6-16(7-9-18)10-11-19(12-21,13-24-15-22-14-23-24)17-4-2-1-3-5-17/h1-9,14-15,23H,10-11,13H2
42 atoms
Cl 3.302735 -2.063167 -3.327024
N  -2.254642 2.2094 1.505294
N  -3.488485 1.822445 1.85355
N  -3.65391 2.899119 -0.03101
N  -2.289666 -1.402524 2.422913
C  -0.543202 0.400146 1.687016
C  0.758096 0.107595 2.473872
C  -1.055097 1.775095 2.192176
C  -0.397219 0.458285 0.171102
C  1.354957 -1.291237 2.307171
C  1.87789 -1.569836 0.927738
C  -1.52286 -0.617865 2.073519
C  0.676743 1.145641 -0.388153
C  -1.367384 -0.070422 -0.673577
C  1.129111 -2.293987 0.006705
C  3.101194 -1.045824 0.520426
C  0.795782 1.267501 -1.762959
C  -1.252183 0.059392 -2.051464
C  -2.387597 2.841939 0.34757
C  -0.166866 0.721386 -2.602076
C  1.559688 -2.455616 -1.301756
C  3.55383 -1.200987 -0.780258
C  -4.31335 2.258995 0.921628
C  2.767531 -1.895988 -1.685527
H  0.535118 0.257344 3.532522
H  1.496491 0.864992 2.207579
H  -1.257683 1.7559 3.262267
H  -0.293176 2.528086 2.001062
H  0.621923 -2.048621 2.593258
H  2.170152 -1.367533 3.029485
H  1.435954 1.589335 0.241871
H  -2.222664 -0.601506 -0.274688
H  -3.675357 1.331253 2.724623
H  3.707669 -0.48786 1.224107
H  1.645749 1.792367 -2.178415
H  -2.01475 -0.364051 -2.691427
H  -1.545329 3.262393 -0.178602
H  -0.071432 0.817357 -3.675477
H  0.955836 -3.006868 -2.009882
H  4.50223 -0.778283 -1.083017
H  -5.378334 2.101157 0.972245
H  0.179319 -2.722219 0.304138
elementType: Cl N C H
totalener: -1413.97510818 hartree
nucrepener: 2196.14378857 hartree
electener: -3610.11889675 hartree
oneelecener: -6269.37439105 hartree
twoeener: 2659.25549430 hartree
cpcmener: -0.13462772 hartree
kineticenergy: 1409.02792411 hartree
xcener: -115.513695920844 hartree
chargesum: 1.0000000
charge: -0.106598 0.086466 -0.033181 -0.356270 -0.068365 0.749432 -0.227190 -0.099756 -0.260807 -0.100366 0.099056 -0.401890 -0.186033 -0.110644 -0.188883 -0.239716 -0.184969 -0.157727 0.146807 -0.124666 -0.175000 -0.131338 0.204912 0.092146 0.121328 0.122810 0.172697 0.160276 0.102280 0.107854 0.144131 0.133650 0.257386 0.139916 0.158801 0.159768 0.200154 0.160488 0.142740 0.141683 0.205659 0.142956
qa: -0.1066 0.0865 -0.0332 -0.3563 -0.0684 0.7494 -0.2272 -0.0998 -0.2608 -0.1004 0.0991 -0.4019 -0.1860 -0.1106 -0.1889 -0.2397 -0.1850 -0.1577 0.1468 -0.1247 -0.1750 -0.1313 0.2049 0.0921 0.1213 0.1228 0.1727 0.1603 0.1023 0.1079 0.1441 0.1337 0.2574 0.1399 0.1588 0.1598 0.2002 0.1605 0.1427 0.1417 0.2057 0.1430
va: 1.1963 3.3938 3.5013 3.0271 3.0982 3.4181 3.9099 3.7793 3.5723 3.8507 3.4876 4.1376 3.9261 3.7645 3.9233 3.9708 3.8820 3.9065 4.0150 3.8489 3.9275 3.9465 3.9426 3.7634 1.0109 1.0001 0.9962 0.9904 1.0130 1.0044 1.0097 1.0186 0.9645 1.0043 0.9937 0.9914 0.9800 0.9887 1.0075 1.0052 0.9724 1.0025
dispersion: -0.028704527 hartree
energy: -1414.003812707610 hartree
dipole: -4.17263 0.55782 -3.61481 7.77014 -2.97329 4.79685 13.82047 -9.44540 4.37507
magnitude: 7.43087 au
magnitude: 18.88777 debye
