program: Orca
programVersion: 5.0.2
elementType: Cl N N N N C C C C C C C C C C C C C C C C C C C H H H H H H H H H H H H H H H H H H
charge: 1
multiplicity: 1
keywords: wb97x-d3
keywords: def2-TZVPP
keywords: def2/J RIJCOSX
keywords: DEFGRID2
keywords: scfconv7
keywords: smallprint printgap noloewdin
keywords: NOSOSCF
formula: C19H18ClN4
InChI: InChI=1/C19H18ClN4/c20-18-8-6-16(7-9-18)10-11-19(12-21,13-24-15-22-14-23-24)17-4-2-1-3-5-17/h1-9,14-15,23H,10-11,13H2
42 atoms
Cl 5.84355 -3.56902 -1.288782
N  -1.815054 3.284583 0.33351
N  -2.98109 3.229512 -0.321839
N  -3.274883 4.499004 1.420948
N  -0.7887 1.211426 3.091883
C  -0.719053 1.051203 0.483482
C  0.601904 0.350001 0.091067
C  -0.642407 2.509509 -0.024573
C  -1.929161 0.323946 -0.088162
C  0.665592 -1.108353 0.536817
C  1.95109 -1.744797 0.094302
C  -0.784267 1.11571 1.944596
C  -2.02231 0.172263 -1.471654
C  -2.935623 -0.198015 0.715344
C  3.084335 -1.700895 0.900674
C  2.047415 -2.360016 -1.150724
C  -3.105654 -0.48204 -2.036236
C  -4.017412 -0.859804 0.147899
C  -2.030275 4.053892 1.391043
C  -4.107561 -1.002449 -1.227234
C  4.284758 -2.257677 0.484983
C  3.238607 -2.921754 -1.585271
C  -3.8412 3.970946 0.347766
C  4.34972 -2.864912 -0.75902
H  1.435774 0.910396 0.520088
H  0.702705 0.413399 -0.99435
H  0.212089 3.023187 0.411715
H  -0.528456 2.527857 -1.107009
H  -0.178292 -1.660517 0.118957
H  0.580758 -1.169845 1.624482
H  -1.25135 0.566984 -2.122623
H  -2.891821 -0.099641 1.792463
H  -3.093705 2.703617 -1.185465
H  1.177554 -2.408669 -1.794888
H  -3.164318 -0.586744 -3.111449
H  -4.789659 -1.26301 0.789521
H  -1.254494 4.279901 2.105376
H  -4.950872 -1.517037 -1.668222
H  5.154473 -2.218723 1.126803
H  3.294491 -3.40043 -2.553672
H  -4.86058 4.106085 0.024562
H  3.032542 -1.228601 1.874321
elementType: Cl N C H
totalener: -1413.97864754 hartree
nucrepener: 2036.58169322 hartree
electener: -3450.56034077 hartree
oneelecener: -5949.70149285 hartree
twoeener: 2499.14115209 hartree
cpcmener: -0.13695108 hartree
kineticenergy: 1409.01208980 hartree
xcener: -115.503691469483 hartree
chargesum: 1.0000000
charge: -0.104964 0.083033 -0.023007 -0.363192 -0.070397 0.832443 -0.253364 -0.141849 -0.420841 -0.020949 0.014884 -0.370460 -0.188669 -0.090634 -0.214179 -0.212020 -0.148548 -0.156256 0.166308 -0.132287 -0.149004 -0.153601 0.201108 0.090739 0.132992 0.124769 0.162156 0.176188 0.103252 0.106601 0.145930 0.136108 0.258401 0.143585 0.163136 0.162199 0.208128 0.163855 0.143928 0.144598 0.205648 0.144232
qa: -0.1050 0.0830 -0.0230 -0.3632 -0.0704 0.8324 -0.2534 -0.1418 -0.4208 -0.0209 0.0149 -0.3705 -0.1887 -0.0906 -0.2142 -0.2120 -0.1485 -0.1563 0.1663 -0.1323 -0.1490 -0.1536 0.2011 0.0907 0.1330 0.1248 0.1622 0.1762 0.1033 0.1066 0.1459 0.1361 0.2584 0.1436 0.1631 0.1622 0.2081 0.1639 0.1439 0.1446 0.2056 0.1442
va: 1.1996 3.3959 3.5008 3.0429 3.1074 3.2910 3.8874 3.8284 3.6824 3.6975 3.5856 4.1316 3.9017 3.8134 3.9886 3.9828 3.9179 3.9288 3.9868 3.8766 3.9746 3.9809 3.9429 3.8143 1.0106 1.0054 0.9979 0.9850 1.0110 1.0146 1.0146 1.0173 0.9623 1.0040 0.9897 0.9914 0.9768 0.9876 1.0050 1.0050 0.9726 1.0038
dispersion: -0.023017604 hartree
energy: -1414.001665145553 hartree
dipole: -18.59000 13.79283 -4.79716 7.64181 -2.22058 5.42123 -2.09338 -0.29873 -2.39211
magnitude: 7.62395 au
magnitude: 19.37855 debye
