program: Orca
programVersion: 5.0.2
elementType: Cl N N N N C C C C C C C C C C C C C C C C C C C H H H H H H H H H H H H H H H H H H
charge: 1
multiplicity: 1
keywords: wb97x-d3
keywords: def2-TZVPP
keywords: def2/J RIJCOSX
keywords: DEFGRID2
keywords: scfconv7
keywords: smallprint printgap noloewdin
keywords: NOSOSCF
formula: C19H18ClN4
InChI: InChI=1/C19H18ClN4/c20-18-8-6-16(7-9-18)10-11-19(12-21,13-24-15-22-14-23-24)17-4-2-1-3-5-17/h1-9,14-15,22H,10-11,13H2
42 atoms
Cl -4.11214 -3.354069 -0.933232
N  0.839167 3.091778 -0.115307
N  2.048344 3.326454 -0.648393
N  0.469474 3.924045 -2.022615
N  -1.697559 0.855814 -0.339159
C  0.539084 0.881865 0.999687
C  0.418372 0.278535 2.418255
C  0.723774 2.414997 1.16853
C  1.697261 0.306335 0.197052
C  0.377333 -1.24948 2.45911
C  -0.741335 -1.83012 1.640724
C  -0.727852 0.749928 0.271691
C  1.525594 -0.20077 -1.085231
C  2.97419 0.316269 0.752665
C  -0.480527 -2.526359 0.465905
C  -2.068207 -1.650908 2.022698
C  2.612105 -0.690298 -1.798233
C  4.056937 -0.171374 0.041123
C  -0.12725 3.443804 -0.936351
C  3.878968 -0.676215 -1.23944
C  -1.510926 -3.002444 -0.329298
C  -3.10842 -2.115595 1.239121
C  1.812992 3.834493 -1.811062
C  -2.82301 -2.7824 0.05605
H  -0.476771 0.688983 2.893399
H  1.266716 0.628725 3.011662
H  -0.113316 2.849689 1.714616
H  1.641034 2.631416 1.711075
H  0.275323 -1.543556 3.506468
H  1.334642 -1.650648 2.12255
H  0.540654 -0.247868 -1.532435
H  3.140919 0.698856 1.75288
H  0.544365 -2.704376 0.163601
H  -2.301695 -1.138671 2.949367
H  2.460098 -1.095065 -2.789831
H  5.0408 -0.161711 0.489981
H  -1.188702 3.353104 -0.769037
H  4.723412 -1.064205 -1.792632
H  -1.295302 -3.546283 -1.238543
H  -4.134772 -1.968025 1.5448
H  2.563769 4.14895 -2.516699
H  0.001202 4.282241 -2.843821
totalener: -1413.88377353 hartree
nucrepener: 2159.54042011 hartree
electener: -3573.42419363 hartree
oneelecener: -6198.27403520 hartree
twoeener: 2624.84984157 hartree
kineticenergy: 1409.08451674 hartree
xcener: -115.518539629302 hartree
chargesum: 1.0000000
charge: -0.050339 0.127131 -0.220201 -0.116192 -0.005533 0.827602 -0.238848 -0.189731 -0.186899 -0.134070 0.022737 -0.492016 -0.241229 -0.234547 -0.145364 -0.149870 -0.105288 -0.108991 0.160496 -0.110945 -0.140705 -0.128983 0.148095 0.100886 0.121187 0.110556 0.167200 0.152647 0.122425 0.107837 0.150196 0.117661 0.126057 0.111758 0.148819 0.146916 0.219623 0.150086 0.128422 0.128492 0.190358 0.212566
qa: -0.0503 0.1271 -0.2202 -0.1162 -0.0055 0.8276 -0.2388 -0.1897 -0.1869 -0.1341 0.0227 -0.4920 -0.2412 -0.2345 -0.1454 -0.1499 -0.1053 -0.1090 0.1605 -0.1109 -0.1407 -0.1290 0.1481 0.1009 0.1212 0.1106 0.1672 0.1526 0.1224 0.1078 0.1502 0.1177 0.1261 0.1118 0.1488 0.1469 0.2196 0.1501 0.1284 0.1285 0.1904 0.2126
va: 1.2563 3.4414 2.8981 3.5591 3.0373 3.1562 3.8787 3.8575 3.5770 3.9007 3.6005 3.9941 3.8674 4.0306 3.9139 3.9670 3.9549 4.0187 3.9331 3.9703 4.0319 4.0325 3.9230 3.9704 1.0030 1.0094 0.9964 1.0056 1.0029 1.0095 1.0125 1.0187 0.9948 1.0118 0.9968 0.9970 0.9820 0.9947 1.0113 1.0109 0.9811 0.9898
dispersion: -0.026023059 hartree
energy: -1413.909796584354 hartree
dipole: 18.68216 -16.38351 2.29865 9.11075 -3.62354 5.48721 8.63187 -9.68070 -1.04883
magnitude: 6.04097 au
magnitude: 15.35492 debye
